{"text_format":"1","workbook":"xlsx","n_sheets":10,"sheets":["Site Data","D.A. A","D.A. B","D.A. C","D.A. D","D.A. E","Runoff Reduction Summary","Channel and Flood Protection","Print Summary","Summary_BU"],"not_rendered":{"charts":0,"images":0,"macros":1,"external_links":0,"defined_names":25,"comments":6,"pivot_tables":0},"unopened":[],"bounds":{"document_bytes":16777216,"sheet_cells":100000,"rows_first":2000,"rows_last":500,"rows_between":2000,"halvings":0,"cell_chars":16384,"cell_head_chars":4096},"cells_cut":0,"cells_raw":0,"read":"whole","date_system":"1900"}

{"sheet":"Site Data","index":0,"n_rows":88,"n_cols":9,"rows_kept":88,"cut":false,"hidden":false,"merged":[[8,1,8,5],[83,1,83,2],[80,0,80,2],[81,0,81,2],[82,0,82,2],[78,0,78,2],[79,0,79,2]]}
["West Virginia MS4 Stormwater Compliance Spreadsheet v2.0; April 2013"]
[]
[null,"data input cells"]
[null,"calculation cells"]
[null,"constant values"]
[]
["Site Data"]
[]
["Site Name:"]
[]
[]
["Site Information"]
[]
["Post-Development Land Cover"]
["Drainage Area A"]
["Land Cover Type","HSG A Soils","HSG B Soils","HSG C Soils","HSG D Soils","Totals"]
["Forest/Preserved Open Space (acres)",0,0,0,0,{"$f":"SUM(B17:E17)","v":0}]
["Managed Turf (acres)",0,0,0,0,{"$f":"SUM(B18:E18)","v":0}]
["Impervious Cover (acres)",0,0,0,0,{"$f":"SUM(B19:E19)","v":0}]
[null,null,null,null,"Total",{"$f":"SUM(F17:F19)","v":0}]
[]
["Drainage Area B"]
["Land Cover Type","HSG A Soils","HSG B Soils","HSG C Soils","HSG D Soils","Totals"]
["Forest/Preserved Open Space (acres)",0,0,0,0,{"$f":"SUM(B24:E24)","v":0}]
["Managed Turf (acres)",0,0,0,0,{"$f":"SUM(B25:E25)","v":0}]
["Impervious Cover (acres)",0,0,0,0,{"$f":"SUM(B26:E26)","v":0}]
[null,null,null,null,"Total",{"$f":"SUM(F24:F26)","v":0}]
[]
["Drainage Area C"]
["Land Cover Type","HSG A Soils","HSG B Soils","HSG C Soils","HSG D Soils","Totals"]
["Forest/Preserved Open Space (acres)",0,0,0,0,{"$f":"SUM(B31:E31)","v":0}]
["Managed Turf (acres)",0,0,0,0,{"$f":"SUM(B32:E32)","v":0}]
["Impervious Cover (acres)",0,0,0,0,{"$f":"SUM(B33:E33)","v":0}]
[null,null,null,null,"Total",{"$f":"SUM(F31:F33)","v":0}]
[]
["Drainage Area D"]
["Land Cover Type","HSG A Soils","HSG B Soils","HSG C Soils","HSG D Soils","Totals"]
["Forest/Preserved Open Space (acres)",0,0,0,0,{"$f":"SUM(B38:E38)","v":0}]
["Managed Turf (acres)",0,0,0,0,{"$f":"SUM(B39:E39)","v":0}]
["Impervious Cover (acres)",0,0,0,0,{"$f":"SUM(B40:E40)","v":0}]
[null,null,null,null,"Total",{"$f":"SUM(F38:F40)","v":0}]
[]
["Drainage Area E"]
["Land Cover Type","HSG A Soils","HSG B Soils","HSG C Soils","HSG D Soils","Totals"]
["Forest/Preserved Open Space (acres)",0,0,0,0,{"$f":"SUM(B45:E45)","v":0}]
["Managed Turf (acres)",0,0,0,0,{"$f":"SUM(B46:E46)","v":0}]
["Impervious Cover (acres)",0,0,0,0,{"$f":"SUM(B47:E47)","v":0}]
[null,null,null,null,"Total",{"$f":"SUM(F45:F47)","v":0}]
[]
["Total Site Area"]
["Land Cover Type","HSG A Soils","HSG B Soils","HSG C Soils","HSG D Soils","Totals"]
["Forest/Preserved Open Space (acres)",{"$f":"SUMIFS(B$17:B$47,$A$17:$A$47,$A52)","v":0},{"$f":"SUMIFS(C$17:C$47,$A$17:$A$47,$A52)","v":0},0,0,{"$f":"SUM(B52:E52)","v":0}]
["Managed Turf (acres)",{"$f":"SUMIFS(B$17:B$47,$A$17:$A$47,$A53)","v":0},0,0,0,{"$f":"SUM(B53:E53)","v":0}]
["Impervious Cover (acres)",0,0,0,0,{"$f":"SUM(B54:E54)","v":0}]
["Total:  ",{"$f":"SUM(B52:B54)","v":0},{"$f":"SUM(C52:C54)","v":0},0,0,0]
[]
[]
["Rv Coefficients"]
["Land Cover Type","HSG A Soils","HSG B Soils","HSG C Soils","HSG D Soils"]
["Forest/Preserved Open Space",0,0,0,0]
["Managed Turf",0.15,0.2,0.22,0.25]
["Impervious Cover",0.95,0.95,0.95,0.95]
[]
["Land Cover Summary"]
["Forest/Preserved Open Space (acres)",{"$f":"F17+F24+F31+F38+F45","v":0}]
["Weighted Rv(forest)",{"$f":"B60","v":0}]
["% Forest",{"$f":"IFERROR(B65/B74,0)","v":0}]
["Managed Turf (acres)",{"$f":"F18+F25+F32+F39+F46","v":0}]
["Weighted Rv(turf)",{"$f":"IF(B68>0,(SUMPRODUCT(B18:E18+B25:E25+B32:E32+B39:E39+B46:E46,B61:E61))/B68,0)","v":0}]
["% Managed Turf",{"$f":"IFERROR(B68/B74,0)","v":0}]
["Impervious Cover (acres)",{"$f":"F19+F26+F33+F40+F47","v":0}]
["Rv(impervious)",{"$f":"B62","v":0.95}]
["% Impervious",{"$f":"IFERROR(B71/B74,0)","v":0}]
["Site Area (acres)",{"$f":"B65+B68+B71","v":0}]
["Site Rv",{"$f":"B66*B67+B69*B70+B72*B73","v":0}]
[]
["Development Credits (Select all that apply)"]
["Is the proposed development:"]
["a) Redevelopment?",null,null,"No",null,null,null,null,"Yes"]
["b) Brownfield redevelopment?",null,null,"No",null,null,null,null,"No"]
["c) High density (>7 units per acre)?",null,null,"No"]
["d) Vertical Density, (Floor to Area Ratio (FAR) of 2 or >18 units per acre)?",null,null,"No"]
["e) Mixed use or Transit Oriented Development (within 1/2 mile of transit)?",null,null,"No"]
[null,"Total Credits (inches)",null,{"$f":"IF(COUNTIF(D79:D83,I79)*0.2<0.75,COUNTIF(D79:D83,I79)*0.2,0.75)","v":0}]
[]
["Runoff Reduction Rainfall Event (inches)",{"$f":"1-D84","v":1}]
["Target Runoff Reduction Volume, RRv (acre-feet)",{"$f":"B86/12*B75*B74","v":0}]
["Target Runoff Reduction Volume, RRv (cubic feet)",{"$f":"B87*43560","v":0}]

{"sheet":"D.A. A","index":1,"n_rows":71,"n_cols":37,"rows_kept":71,"cut":false,"hidden":false,"merged":[]}
["West Virginia MS4 Stormwater Compliance Spreadsheet v2.0; April 2013"]
[]
["Drainage Area A"]
[]
[]
["Drainage Area A Post-Development Land Cover (acres)"]
["Land Cover Type","HSG A soils","HSG B Soils","HSG C Soils","HSG D Soils","Totals"]
["Forest/Preserved Open Space",{"$f":"'Site Data'!B17","v":0},{"$f":"'Site Data'!C17","v":0},{"$f":"'Site Data'!D17","v":0},{"$f":"'Site Data'!E17","v":0},{"$f":"SUM(B8:E8)","v":0},null,{"$f":"\"RRv Achieved for Drainage Area \"&RIGHT(A3,1)&\" (cubic feet)\"","v":"RRv Achieved for Drainage Area A (cubic feet)"},null,null,{"$f":"K48","v":0}]
["Managed Turf",{"$f":"'Site Data'!B18","v":0},{"$f":"'Site Data'!C18","v":0},{"$f":"'Site Data'!D18","v":0},{"$f":"'Site Data'!E18","v":0},{"$f":"SUM(B9:E9)","v":0},null,{"$f":"\"RRv Balance for Drainage Area \"&RIGHT(A3,1)&\" (cubic feet)\"","v":"RRv Balance for Drainage Area A (cubic feet)"},null,null,{"$f":"'Site Data'!B86/12*B12*F11*43560-K8","v":0},{"$f":"IFERROR(L49,\"\")","v":""}]
["Impervious Cover ",{"$f":"'Site Data'!B19","v":0},{"$f":"'Site Data'!C19","v":0},{"$f":"'Site Data'!D19","v":0},{"$f":"'Site Data'!E19","v":0},{"$f":"SUM(B10:E10)","v":0},null,"RRv Balance for Total Site (cubic feet)",null,null,{"$f":"K49","v":0}]
[null,null,null,null,"Total",{"$f":"SUM(F8:F10)","v":0}]
["Rv(drainage area)",{"$f":"IFERROR(B13*F9/F11+B14*F10/F11,0)","v":0}]
["Rv(turf)",{"$f":"IF(F9>0,SUMPRODUCT(B9:E9,'Site Data'!B61:E61)/F9,0)","v":0}]
["Rv(impervious)",0.95]
[]
["Apply Runoff Reduction Practices"]
["Runoff Reduction Practice","Impervious Cover in Contributing Drainage Area (acres)","Managed Turf in Contributing Drainage Area (acres)","Volume Received by Practice      (cubic feet)","Description of Credit","% Credit","Volume Received from Upstream Practices     (cubic feet)","Total Volume Received by Practice       (cubic feet)","Disconnection Area of Practice (square feet)","Storage Volume Provided by Practice    (cubic feet)","Runoff Reduction (cubic feet)","Remaining Volume    (cubic feet)","Downstream Practice",null,null,null,{"$f":"A21","v":"Simple Disconnection to A/B Soils or Soil-Amended Filter Path in C/D Soils (4.2.2, Appendix D)"},{"$f":"A22","v":"Simple Disconnection to C/D Soils (4.2.2)"},{"$f":"A23","v":"To Residential Rain Garden (4.2.3.C)"},{"$f":"A24","v":"To Rainwater Harvesting (4.2.8)"},{"$f":"A30","v":"Grass Swale A/B Soils"},{"$f":"A31","v":"Grass Swale C/D Soils"},{"$f":"A32","v":"Grass Swale in C/D Soil with Soil Amendments"},{"$f":"A34","v":"Water Quality Swale, Level 1"},{"$f":"A35","v":"Water Quality Swale, Level 2"},{"$f":"A37","v":"Bioretention, Level 1 or Urban Bioretention (4.2.3.B)"},{"$f":"A38","v":"Bioretention, Level 2"},{"$f":"A40","v":"Infiltration"},{"$f":"A42","v":"*Filtration Practice/Stormwater Wetland do NOT receive runoff reduction values, but do have associated pollutant removal values"},{"$f":"A44","v":"Sheetflow to Conservation Area with A/B Soils"},{"$f":"A45","v":"Sheetflow to Conservation Area with C/D Soils"},{"$f":"A46","v":"Sheetflow to Vegetated Filter Strip in A/B Soils or Compost Amended C/D Soils"},{"$f":"A47","v":"Sheet flow to Vegetated Filter Strip in C/D Soils"},null,{"$f":"A30","v":"Grass Swale A/B Soils"},{"$f":"A31","v":"Grass Swale C/D Soils"},{"$f":"A32","v":"Grass Swale in C/D Soil with Soil Amendments"}]
["1. Vegetated Roof (4.2.9)"]
["Vegetated Roof",null,"N/A",{"$f":"1/12*0.95*B19*43560","v":0},"Reduce volume conveyed through green roof by 100%.",1,"N/A",{"$f":"D19","v":0},"N/A",null,{"$f":"IF(J19*F19<=H19,J19*F19,H19)","v":0},{"$f":"H19-K19","v":0},null,null,null,null,{"$f":"IF($M19=Q$17, $L19, 0)","v":0},{"$f":"IF($M19=R$17, $L19, 0)","v":0},0,0,{"$f":"IF($M19=U$17, $L19, 0)","v":0},{"$f":"IF($M19=V$17, $L19, 0)","v":0},{"$f":"IF($M19=W$17, $L19, 0)","v":0},0,0,0,0,0,0,0,0,{"$f":"IF($M19=AF$17, $L19, 0)","v":0},{"$f":"IF($M19=AG$17, $L19, 0)","v":0},null,{"$f":"IF($M19=AI$17, $H19, 0)","v":0},{"$f":"IF($M19=AJ$17, $H19, 0)","v":0},{"$f":"IF($M19=AK$17, $H19, 0)","v":0}]
["2. Impervious Surface Disconnection/Rooftop Practices ",null,null,null,null,null,null,null,null,null,null,null,null,null,null,null,null,null,null,null,null,null,null,null,null,null,null,null,null,null,null,null,{"$f":"IF($M20=AG$17, $L20, 0)","v":0}]
["Simple Disconnection to A/B Soils or Soil-Amended Filter Path in C/D Soils (4.2.2, Appendix D)",null,"N/A",{"$f":"1/12*0.95*B21*43560","v":0},"Reduce volume conveyed to conservation area by 4 cu. ft per each 100 sq. ft. of pervious receiving area.","N/A",{"$f":"Q49","v":0},{"$f":"D21+G21","v":0},null,"N/A",{"$f":"IF(I21*0.04<=H21,I21*0.04,H21)","v":0},0,null,null,null,null,{"$f":"IF($M21=Q$17, $L21, 0)","v":0},0,0,0,{"$f":"IF($M21=U$17, $L21, 0)","v":0},0,0,0,0,0,0,0,0,0,0,{"$f":"IF($M21=AF$17, $L21, 0)","v":0},0,null,{"$f":"IF($M21=AI$17, $H21, 0)","v":0},0,0]
["Simple Disconnection to C/D Soils (4.2.2)",null,"N/A",{"$f":"1/12*0.95*B22*43560","v":0},"Reduce volume conveyed to conservation area by 2 cu. ft per each 100 sq. ft. of pervious receiving area.","N/A",{"$f":"R49","v":0},{"$f":"D22+G22","v":0},null,"N/A",{"$f":"IF(I22*0.02<=H22,I22*0.02,H22)","v":0},0,null,null,null,null,{"$f":"IF($M22=Q$17, $L22, 0)","v":0},0,0,0,0,0,0,0,0,0,0,0,0,0,0,{"$f":"IF($M22=AF$17, $L22, 0)","v":0},0,null,0,0,0]
["To Residential Rain Garden (4.2.3.C)",null,"N/A",{"$f":"1/12*0.95*B23*43560","v":0},"60% volume reduction for the Design Volume of the practice",0.6,{"$f":"S49","v":0},{"$f":"D23+G23","v":0},"N/A",null,{"$f":"IF(J23*F23<=H23,J23*F23,H23)","v":0},0,null,null,null,null,{"$f":"IF($M23=Q$17, $L23, 0)","v":0},0,0,0,0,0,0,0,0,0,0,0,0,0,0,{"$f":"IF($M23=AF$17, $L23, 0)","v":0},0,null,0,0,0]
["To Rainwater Harvesting (4.2.8)",null,"N/A",{"$f":"1/12*0.95*B24*43560","v":0},"Subtract a variable % of the provided Design Volume based on annual  beneficial use (see Cistern Design Spreadsheet).",null,{"$f":"T49","v":0},{"$f":"D24+G24","v":0},"N/A",null,{"$f":"IF(J24*F24<=H24,J24*F24,H24)","v":0},0,null,null,null,null,{"$f":"IF($M24=Q$17, $L24, 0)","v":0},0,0,0,0,0,0,0,0,0,0,0,0,0,0,{"$f":"IF($M24=AF$17, $L24, 0)","v":0},0,null,0,0,0]
["3. Permeable Pavement (4.2.4)",null,null,null,null,null,null,null,null,null,null,null,null,"Storage Volume Provided by Sump Below Underdrain (cubic feet)","Storage Volume Provided by Reservoir Layer Above Underdrain (cubic feet)"]
["Permeable Pavement, Level 1",null,"N/A",{"$f":"1/12*0.95*B26*43560","v":0},"Subtract 45% of the provided storage volume.",0.45,"N/A",{"$f":"D26","v":0},"N/A",null,{"$f":"IF(J26*F26<=H26,J26*F26,H26)","v":0},0,null,null,null,null,{"$f":"IF($M26=Q$17, $L26, 0)","v":0},0,0,0,{"$f":"IF($M26=U$17, $L26, 0)","v":0},0,0,0,0,0,0,0,0,0,0,{"$f":"IF($M26=AF$17, $L26, 0)","v":0},0,null,{"$f":"IF($M26=AI$17, $H26, 0)","v":0},0,0]
["Permeable Pavement, Level 2 (infiltration)",null,"N/A",{"$f":"1/12*0.95*B27*43560","v":0},"Subtract 100% of the provided storage volume.",1,"N/A",{"$f":"D27","v":0},"N/A",null,{"$f":"IF(J27*F27<=H27,J27*F27,H27)","v":0},{"$f":"H27-K27","v":0},null,null,null,null,{"$f":"IF($M27=Q$17, $L27, 0)","v":0},0,0,0,0,0,0,0,0,0,0,0,0,0,0,{"$f":"IF($M27=AF$17, $L27, 0)","v":0},0,null,0,0,0]
["Permeable Pavement, Level 2 (infiltration & underdrain)",null,"N/A",{"$f":"1/12*0.95*B28*43560","v":0},"Subtract 100% of the provided storage volume of sump and 45% of the provided storage volume in reservoir layer.",null,"N/A",{"$f":"D28","v":0},"N/A",null,{"$f":"IF(N28*F27+O28*F26<=H28,N28*F27+O28*F26,H28)","v":0},0,null,null,null,null,{"$f":"IF($M28=Q$17, $L28, 0)","v":0},0,0,0,0,0,0,0,0,0,0,0,0,0,0,{"$f":"IF($M28=AF$17, $L28, 0)","v":0},0,null,{"$f":"IF($M28=AI$17, $H28, 0)","v":0},{"$f":"IF($M28=AJ$17, $H28, 0)","v":0},{"$f":"IF($M28=AK$17, $H28, 0)","v":0}]
["4. Grass Swale (4.2.5)",null,null,null,null,null,null,null,null,null,null,null,null,"Water volume associated with contributing area (cubic feet)",null,null,null,null,null,null,null,null,null,null,null,null,null,null,null,null,null,null,0]
["Grass Swale A/B Soils",null,null,{"$f":"1/12*(0.95*B30+$B$13*C30)*43560","v":0},"Reduce volume conveyed through grass swale by 0.2 inches.",0.2,{"$f":"U49","v":0},{"$f":"D30+G30","v":0},"N/A","N/A",{"$f":"IF((H30+(N30-G30))*F30>H30,H30,(H30+(N30-G30))*F30)","v":0},{"$f":"(D30-D30*F30)+IF((G30-N30*F30)<0,0,(G30-N30*F30))","v":0},null,{"$f":"AI49","v":0},null,null,{"$f":"IF($M30=Q$17, $L30, 0)","v":0},0,0,0,{"$f":"IF($M30=U$17, $L30, 0)","v":0},0,0,0,0,0,0,0,0,0,0,{"$f":"IF($M30=AF$17, $L30, 0)","v":0},0,null,{"$f":"IF($M30=AI$17, $H30, 0)","v":0},0,0]
["Grass Swale C/D Soils",null,null,{"$f":"1/12*(0.95*B31+$B$13*C31)*43560","v":0},"Reduce volume conveyed through grass swale by 0.1 inches.",0.1,{"$f":"V49","v":0},{"$f":"D31+G31","v":0},"N/A","N/A",{"$f":"IF((H31+(N31-G31))*F31>H31,H31,(H31+(N31-G31))*F31)","v":0},{"$f":"(D31-D31*F31)+IF((G31-N31*F31)<0,0,(G31-N31*F31))","v":0},null,{"$f":"AJ49","v":0},null,null,{"$f":"IF($M31=Q$17, $L31, 0)","v":0},0,0,0,0,0,0,0,0,0,0,0,0,0,0,{"$f":"IF($M31=AF$17, $L31, 0)","v":0},0,null,0,0,0]
["Grass Swale in C/D Soil with Soil Amendments",null,null,{"$f":"1/12*(0.95*B32+$B$13*C32)*43560","v":0},"Reduce volume conveyed through grass swale by 0.2 inches.",0.2,{"$f":"W49","v":0},{"$f":"D32+G32","v":0},"N/A","N/A",0,0,null,{"$f":"AK49","v":0},null,null,{"$f":"IF($M32=Q$17, $L32, 0)","v":0},0,0,0,0,0,0,0,0,0,0,0,0,0,0,{"$f":"IF($M32=AF$17, $L32, 0)","v":0},0,null,0,0,0]
["5. Water Quality Swale (4.2.3.A)",null,null,null,null,null,null,null,null,null,null,null,null,null,null,null,null,null,null,null,null,null,null,null,null,null,null,null,null,null,null,null,0]
["Water Quality Swale, Level 1",null,null,{"$f":"1/12*(0.95*B34+$B$13*C34)*43560","v":0},"Subtract 55% of the provided storage volume.",0.55000000000000004,{"$f":"X49","v":0},{"$f":"D34+G34","v":0},"N/A",null,{"$f":"IF(J34*F34<=H34,J34*F34,H34)","v":0},0,null,null,null,null,{"$f":"IF($M34=Q$17, $L34, 0)","v":0},0,0,0,{"$f":"IF($M34=U$17, $L34, 0)","v":0},0,0,0,0,0,0,0,0,0,0,{"$f":"IF($M34=AF$17, $L34, 0)","v":0},0,null,{"$f":"IF($M34=AI$17, $H34, 0)","v":0},0,0]
["Water Quality Swale, Level 2",null,null,{"$f":"1/12*(0.95*B35+$B$13*C35)*43560","v":0},"Subtract 100% of the provided storage volume.",1,{"$f":"Y49","v":0},{"$f":"D35+G35","v":0},"N/A",null,{"$f":"IF(J35*F35<=H35,J35*F35,H35)","v":0},0,null,null,null,null,{"$f":"IF($M35=Q$17, $L35, 0)","v":0},0,0,0,0,0,0,0,0,0,0,0,0,0,0,{"$f":"IF($M35=AF$17, $L35, 0)","v":0},0,null,0,0,0]
["6. Bioretention (4.2.3)",null,null,null,null,null,null,null,null,null,null,null,null,null,null,null,null,null,null,null,null,null,null,null,null,null,null,null,null,null,null,null,0]
["Bioretention, Level 1 or Urban Bioretention (4.2.3.B)",null,null,{"$f":"1/12*(0.95*B37+$B$13*C37)*43560","v":0},"Subtract 60% of the provided storage volume.",0.6,{"$f":"Z49","v":0},{"$f":"D37+G37","v":0},"N/A",null,{"$f":"IF(J37*F37<=H37,J37*F37,H37)","v":0},0,null,null,null,null,{"$f":"IF($M37=Q$17, $L37, 0)","v":0},0,0,0,{"$f":"IF($M37=U$17, $L37, 0)","v":0},0,0,0,0,0,0,0,0,0,0,{"$f":"IF($M37=AF$17, $L37, 0)","v":0},0,null,{"$f":"IF($M37=AI$17, $H37, 0)","v":0},0,0]
["Bioretention, Level 2",null,null,{"$f":"1/12*(0.95*B38+$B$13*C38)*43560","v":0},"Subtract 100% of the provided storage volume.",1,{"$f":"AA49","v":0},{"$f":"D38+G38","v":0},"N/A",null,{"$f":"IF(J38*F38<=H38,J38*F38,H38)","v":0},0,null,null,null,null,0,0,0,0,0,0,0,0,0,0,0,0,0,0,{"$f":"IF($M38=AE$17, $L38, 0)","v":0},{"$f":"IF($M38=AF$17, $L38, 0)","v":0},0,null,0,0,0]
["7. Infiltration (4.2.6) or Regenerative Stormwater Conveyance (4.2.7)",null,null,null,null,null,null,null,null,null,null,null,null,null,null,null,null,null,null,null,null,null,null,null,null,null,null,null,null,null,null,null,0]
["Infiltration",null,null,{"$f":"1/12*(0.95*B40+$B$13*C40)*43560","v":0},"Subtract 100% of the provided storage volume.",1,{"$f":"AB49","v":0},{"$f":"D40+G40","v":0},"N/A",null,{"$f":"IF(J40*F40<=H40,J40*F40,H40)","v":0},0,null,null,null,null,{"$f":"IF($M40=Q$17, $L40, 0)","v":0},{"$f":"IF($M40=R$17, $L40, 0)","v":0},0,0,{"$f":"IF($M40=U$17, $L40, 0)","v":0},{"$f":"IF($M40=V$17, $L40, 0)","v":0},{"$f":"IF($M40=W$17, $L40, 0)","v":0},0,0,0,0,0,0,0,0,{"$f":"IF($M40=AF$17, $L40, 0)","v":0},0,null,{"$f":"IF($M40=AI$17, $H40, 0)","v":0},{"$f":"IF($M40=AJ$17, $H40, 0)","v":0},{"$f":"IF($M40=AK$17, $H40, 0)","v":0}]
["8. Filtration Practice (4.2.10) or Stormwater Wetland (4.2.11)*",null,null,null,null,null,null,null,null,null,null,null,null,null,null,null,null,null,null,null,null,null,null,null,null,null,null,null,null,null,null,null,0]
["*Filtration Practice/Stormwater Wetland do NOT receive runoff reduction values, but do have associated pollutant removal values",null,null,{"$f":"1/12*(0.95*B42+$B$13*C42)*43560","v":0},"0% runoff reduction",0,{"$f":"AC49","v":0},{"$f":"D42+G42","v":0},"N/A",{"$f":"0.1*H42","v":0},{"$f":"IF(J42*F42<=H42,J42*F42,H42)","v":0},0,null,null,null,null,{"$f":"IF($M42=Q$17, $L42, 0)","v":0},{"$f":"IF($M42=R$17, $L42, 0)","v":0},0,0,{"$f":"IF($M42=U$17, $L42, 0)","v":0},{"$f":"IF($M42=V$17, $L42, 0)","v":0},{"$f":"IF($M42=W$17, $L42, 0)","v":0},0,0,0,0,0,0,0,0,{"$f":"IF($M42=AF$17, $L42, 0)","v":0},0,null,{"$f":"IF($M42=AI$17, $H42, 0)","v":0},0,0]
["9. Sheetflow to Filter/Conservation Area (4.2.1)"]
["Sheetflow to Conservation Area with A/B Soils",null,null,{"$f":"1/12*(0.95*B44+$B$13*C44)*43560","v":0},"Reduce volume conveyed to conservation area by 9 cu. ft per each 100 sq. ft. of conservation area.","N/A",{"$f":"AD49","v":0},{"$f":"D44+G44","v":0},null,"N/A",{"$f":"IF(I44*0.09<=H44,I44*0.09,H44)","v":0},0,null,null,null,null,{"$f":"IF($M44=Q$17, $L44, 0)","v":0},0,0,0,{"$f":"IF($M44=U$17, $L44, 0)","v":0},0,0,0,0,0,0,0,0,0,0,0,0,null,0,0,0]
["Sheetflow to Conservation Area with C/D Soils",null,null,{"$f":"1/12*(0.95*B45+$B$13*C45)*43560","v":0},"Reduce volume conveyed to conservation area by 4 cu. ft per each 100 sq. ft. of conservation area.","N/A",{"$f":"AE49","v":0},{"$f":"D45+G45","v":0},null,"N/A",{"$f":"IF(I45*0.04<=H45,I45*0.04,H45)","v":0},0,null,null,null,null,0,0,0,0,0,0,0,0,0,0,0,0,0,0,0,0,0,null,0,0,0]
["Sheetflow to Vegetated Filter Strip in A/B Soils or Compost Amended C/D Soils",null,null,{"$f":"1/12*(0.95*B46+$B$13*C46)*43560","v":0},"Reduce volume conveyed to conservation area by 6 cu. ft per each 100 sq. ft. of filter strip.","N/A",{"$f":"AF49","v":0},{"$f":"D46+G46","v":0},null,"N/A",{"$f":"IF(I46*0.06<=H46,I46*0.06,H46)","v":0},0,null,null,null,null,0,0,0,0,0,0,0,0,0,0,0,0,0,0,0,0,0,null,0,0,0]
["Sheet flow to Vegetated Filter Strip in C/D Soils",null,null,{"$f":"1/12*(0.95*B47+$B$13*C47)*43560","v":0},"Reduce volume conveyed to conservation area by 3 cu. ft per each 100 sq. ft. of filter strip.","N/A",{"$f":"AG49","v":0},{"$f":"D47+G47","v":0},null,"N/A",{"$f":"IF(I47*0.03<=H47,I47*0.03,H47)","v":0},{"$f":"H47-K47","v":0},null,null,null,null,0,0,0,0,0,0,0,0,0,0,0,0,0,0,0,0,0,null,0,0,0]
["Totals",{"$f":"IF(SUM(B17:B47)>F10,\"Please Check the Contributing Areas: \" &SUM(B17:B47)-F10&\" acre Over\",SUM(B17:B47))","v":0},{"$f":"IF(SUM(C17:C47)>F9,\"Please Check the Contributing Areas: \" &SUM(C17:C47)-F9&\" acre Over\",SUM(C17:C47))","v":0},null,null,null,null,null,null,"Runoff Reduction Volume Achieved for Drainage Area A:",{"$f":"SUM(K17:K47)","v":0},"See Runoff Reduction Summary Tab for Detailed Results"]
[null,null,null,null,null,null,null,null,null,"Runoff Reduction Volume Balance for Total Site",{"$f":"ROUND('Site Data'!B88-'D.A. A'!K48-'D.A. B'!K48-'D.A. C'!K48-'D.A. D'!K48-'D.A. E'!K48,0)","v":0},{"$f":"IF(ROUND('Site Data'!B88-'D.A. A'!K48-'D.A. B'!K48-'D.A. C'!K48-'D.A. D'!K48-'D.A. E'!K48,0)<0,\"More Credit than needed has been provided\",\"\")","v":""},null,null,null,"Totals",{"$f":"SUM(Q17:Q48)","v":0},0,0,0,0,0,0,0,0,0,0,0,0,0,0,0,0,null,{"$f":"SUM(AI17:AI48)","v":0},0,0]
[]
[]
[]
[]
["Downstream Options"]
[{"$f":"A21","v":"Simple Disconnection to A/B Soils or Soil-Amended Filter Path in C/D Soils (4.2.2, Appendix D)"}]
[{"$f":"A22","v":"Simple Disconnection to C/D Soils (4.2.2)"}]
["To Residential Rain Garden (4.2.3.C)"]
[{"$f":"A24","v":"To Rainwater Harvesting (4.2.8)"}]
[{"$f":"A30","v":"Grass Swale A/B Soils"}]
[{"$f":"A31","v":"Grass Swale C/D Soils"}]
[{"$f":"A32","v":"Grass Swale in C/D Soil with Soil Amendments"}]
[{"$f":"A34","v":"Water Quality Swale, Level 1"}]
[{"$f":"A35","v":"Water Quality Swale, Level 2"}]
[{"$f":"A37","v":"Bioretention, Level 1 or Urban Bioretention (4.2.3.B)"}]
[{"$f":"A38","v":"Bioretention, Level 2"}]
[{"$f":"A40","v":"Infiltration"}]
[{"$f":"A42","v":"*Filtration Practice/Stormwater Wetland do NOT receive runoff reduction values, but do have associated pollutant removal values"}]
[{"$f":"A44","v":"Sheetflow to Conservation Area with A/B Soils"}]
[{"$f":"A45","v":"Sheetflow to Conservation Area with C/D Soils"}]
[{"$f":"A46","v":"Sheetflow to Vegetated Filter Strip in A/B Soils or Compost Amended C/D Soils"}]
[{"$f":"A47","v":"Sheet flow to Vegetated Filter Strip in C/D Soils"}]

{"sheet":"D.A. B","index":2,"n_rows":71,"n_cols":37,"rows_kept":71,"cut":false,"hidden":false,"merged":[[0,0,0,4]]}
["West Virginia MS4 Stormwater Compliance Spreadsheet v2.0; April 2013"]
[]
["Drainage Area B"]
[]
[]
["Drainage Area B Post-Development Land Cover (acres)"]
["Land Cover Type","HSG A soils","HSG B Soils","HSG C Soils","HSG D Soils","Totals"]
["Forest/Preserved Open Space",{"$f":"'Site Data'!B24","v":0},{"$f":"'Site Data'!C24","v":0},{"$f":"'Site Data'!D24","v":0},{"$f":"'Site Data'!E24","v":0},{"$f":"SUM(B8:E8)","v":0},null,{"$f":"\"RRv Achieved for Drainage Area \"&RIGHT(A3,1)&\" (cubic feet)\"","v":"RRv Achieved for Drainage Area B (cubic feet)"},null,null,{"$f":"K48","v":0}]
["Managed Turf",{"$f":"'Site Data'!B25","v":0},{"$f":"'Site Data'!C25","v":0},{"$f":"'Site Data'!D25","v":0},{"$f":"'Site Data'!E25","v":0},{"$f":"SUM(B9:E9)","v":0},null,{"$f":"\"RRv Balance for Drainage Area \"&RIGHT(A3,1)&\" (cubic feet)\"","v":"RRv Balance for Drainage Area B (cubic feet)"},null,null,{"$f":"'Site Data'!B86/12*B12*F11*43560-K8","v":0},{"$f":"IFERROR(L49,\"\")","v":""}]
["Impervious Cover ",{"$f":"'Site Data'!B26","v":0},{"$f":"'Site Data'!C26","v":0},{"$f":"'Site Data'!D26","v":0},{"$f":"'Site Data'!E26","v":0},{"$f":"SUM(B10:E10)","v":0},null,"RRv Balance for Total Site (cubic feet)",null,null,{"$f":"K49","v":0}]
[null,null,null,null,"Total",{"$f":"SUM(F8:F10)","v":0}]
["Rv(drainage area)",{"$f":"IFERROR(B13*F9/F11+B14*F10/F11,0)","v":0}]
["Rv(turf)",{"$f":"IF(F9>0,SUMPRODUCT(B9:E9,'Site Data'!B61:E61)/F9,0)","v":0}]
["Rv(impervious)",0.95]
[]
["Apply Runoff Reduction Practices"]
["Runoff Reduction Practice","Impervious Cover in Contributing Drainage Area (acres)","Managed Turf in Contributing Drainage Area (acres)","Volume Received by Practice      (cubic feet)","Description of Credit","% Credit","Volume Received from Upstream Practices     (cubic feet)","Total Volume Received by Practice       (cubic feet)","Disconnection Area of Practice (square feet)","Storage Volume Provided by Practice    (cubic feet)","Runoff Reduction (cubic feet)","Remaining Volume    (cubic feet)","Downstream Practice",null,null,null,{"$f":"A21","v":"Simple Disconnection to A/B Soils or Soil-Amended Filter Path in C/D Soils (4.2.2, Appendix D)"},{"$f":"A22","v":"Simple Disconnection to C/D Soils (4.2.2)"},{"$f":"A23","v":"To Residential Rain Garden (4.2.3.C)"},{"$f":"A24","v":"To Rainwater Harvesting (4.2.8)"},{"$f":"A30","v":"Grass Swale A/B Soils"},{"$f":"A31","v":"Grass Swale C/D Soils"},{"$f":"A32","v":"Grass Swale in C/D Soil with Soil Amendments"},{"$f":"A34","v":"Water Quality Swale, Level 1"},{"$f":"A35","v":"Water Quality Swale, Level 2"},{"$f":"A37","v":"Bioretention, Level 1 or Urban Bioretention (4.2.3.B)"},{"$f":"A38","v":"Bioretention, Level 2"},{"$f":"A40","v":"Infiltration"},{"$f":"A42","v":"*Filtration Practice/Stormwater Wetland do NOT receive runoff reduction values, but do have associated pollutant removal values"},{"$f":"A44","v":"Sheetflow to Conservation Area with A/B Soils"},{"$f":"A45","v":"Sheetflow to Conservation Area with C/D Soils"},{"$f":"A46","v":"Sheetflow to Vegetated Filter Strip in A/B Soils or Compost Amended C/D Soils"},{"$f":"A47","v":"Sheet flow to Vegetated Filter Strip in C/D Soils"},null,{"$f":"A30","v":"Grass Swale A/B Soils"},{"$f":"A31","v":"Grass Swale C/D Soils"},{"$f":"A32","v":"Grass Swale in C/D Soil with Soil Amendments"}]
["1. Vegetated Roof (4.2.9)"]
["Vegetated Roof",null,"N/A",{"$f":"1/12*0.95*B19*43560","v":0},"Reduce volume conveyed through green roof by 100%.",1,"N/A",{"$f":"D19","v":0},"N/A",null,{"$f":"IF(J19*F19<=H19,J19*F19,H19)","v":0},{"$f":"H19-K19","v":0},null,null,null,null,{"$f":"IF($M19=Q$17, $L19, 0)","v":0},{"$f":"IF($M19=R$17, $L19, 0)","v":0},0,0,{"$f":"IF($M19=U$17, $H19, 0)","v":0},{"$f":"IF($M19=V$17, $H19, 0)","v":0},{"$f":"IF($M19=W$17, $H19, 0)","v":0},0,0,0,0,0,0,0,0,{"$f":"IF($M19=AF$17, $L19, 0)","v":0},{"$f":"IF($M19=AG$17, $L19, 0)","v":0},null,{"$f":"IF($M19=AI$17, $H19, 0)","v":0},{"$f":"IF($M19=AJ$17, $H19, 0)","v":0},{"$f":"IF($M19=AK$17, $H19, 0)","v":0}]
["2. Impervious Surface Disconnection/Rooftop Practices ",null,null,null,null,null,null,null,null,null,null,null,null,null,null,null,null,null,null,null,null,null,null,null,null,null,null,null,null,null,null,null,{"$f":"IF($M20=AG$17, $L20, 0)","v":0}]
["Simple Disconnection to A/B Soils or Soil-Amended Filter Path in C/D Soils (4.2.2, Appendix D)",null,"N/A",{"$f":"1/12*0.95*B21*43560","v":0},"Reduce volume conveyed to conservation area by 4 cu. ft per each 100 sq. ft. of pervious receiving area.","N/A",{"$f":"Q49","v":0},{"$f":"D21+G21","v":0},null,"N/A",{"$f":"IF(I21*0.04<=H21,I21*0.04,H21)","v":0},0,null,null,null,null,{"$f":"IF($M21=Q$17, $L21, 0)","v":0},0,0,0,{"$f":"IF($M21=U$17, $H21, 0)","v":0},0,0,0,0,0,0,0,0,0,0,{"$f":"IF($M21=AF$17, $L21, 0)","v":0},0,null,{"$f":"IF($M21=AI$17, $H21, 0)","v":0},0,0]
["Simple Disconnection to C/D Soils (4.2.2)",null,"N/A",{"$f":"1/12*0.95*B22*43560","v":0},"Reduce volume conveyed to conservation area by 2 cu. ft per each 100 sq. ft. of pervious receiving area.","N/A",{"$f":"R49","v":0},{"$f":"D22+G22","v":0},null,"N/A",{"$f":"IF(I22*0.02<=H22,I22*0.02,H22)","v":0},0,null,null,null,null,{"$f":"IF($M22=Q$17, $L22, 0)","v":0},0,0,0,0,0,0,0,0,0,0,0,0,0,0,{"$f":"IF($M22=AF$17, $L22, 0)","v":0},0,null,0,0,0]
["To Residential Rain Garden (4.2.3.C)",null,"N/A",{"$f":"1/12*0.95*B23*43560","v":0},"60% volume reduction for the Design Volume of the practice",0.6,{"$f":"S49","v":0},{"$f":"D23+G23","v":0},"N/A",null,{"$f":"IF(J23*F23<=H23,J23*F23,H23)","v":0},0,null,null,null,null,{"$f":"IF($M23=Q$17, $L23, 0)","v":0},0,0,0,0,0,0,0,0,0,0,0,0,0,0,{"$f":"IF($M23=AF$17, $L23, 0)","v":0},0,null,0,0,0]
["To Rainwater Harvesting (4.2.8)",null,"N/A",{"$f":"1/12*0.95*B24*43560","v":0},"Subtract a variable % of the provided Design Volume based on annual  beneficial use (see Cistern Design Spreadsheet).",null,{"$f":"T49","v":0},{"$f":"D24+G24","v":0},"N/A",null,{"$f":"IF(J24*F24<=H24,J24*F24,H24)","v":0},0,null,null,null,null,{"$f":"IF($M24=Q$17, $L24, 0)","v":0},0,0,0,0,0,0,0,0,0,0,0,0,0,0,{"$f":"IF($M24=AF$17, $L24, 0)","v":0},0,null,0,0,0]
["3. Permeable Pavement (4.2.4)",null,null,null,null,null,null,null,null,null,null,null,null,"Storage Volume Provided by Sump Below Underdrain (cubic feet)","Storage Volume Provided by Reservoir Layer Above Underdrain (cubic feet)"]
["Permeable Pavement, Level 1",null,"N/A",{"$f":"1/12*0.95*B26*43560","v":0},"Subtract 45% of the provided storage volume.",0.45,"N/A",{"$f":"D26","v":0},"N/A",null,{"$f":"IF(J26*F26<=H26,J26*F26,H26)","v":0},0,null,null,null,null,{"$f":"IF($M26=Q$17, $L26, 0)","v":0},0,0,0,{"$f":"IF($M26=U$17, $H26, 0)","v":0},0,0,0,0,0,0,0,0,0,0,{"$f":"IF($M26=AF$17, $L26, 0)","v":0},0,null,{"$f":"IF($M26=AI$17, $H26, 0)","v":0},0,0]
["Permeable Pavement, Level 2 (infiltration)",null,"N/A",{"$f":"1/12*0.95*B27*43560","v":0},"Subtract 100% of the provided storage volume.",1,"N/A",{"$f":"D27","v":0},"N/A",null,{"$f":"IF(J27*F27<=H27,J27*F27,H27)","v":0},0,null,null,null,null,{"$f":"IF($M27=Q$17, $L27, 0)","v":0},0,0,0,0,0,0,0,0,0,0,0,0,0,0,{"$f":"IF($M27=AF$17, $L27, 0)","v":0},0,null,0,0,0]
["Permeable Pavement, Level 2 (infiltration & underdrain)",null,"N/A",{"$f":"1/12*0.95*B28*43560","v":0},"Subtract 100% of the provided storage volume of sump and 45% of the provided storage volume in reservoir layer.",null,"N/A",{"$f":"D28","v":0},"N/A",null,{"$f":"IF(N28*F27+O28*F26<=H28,N28*F27+O28*F26,H28)","v":0},0,null,null,null,null,{"$f":"IF($M28=Q$17, $L28, 0)","v":0},0,0,0,{"$f":"IF($M28=U$17, $H28, 0)","v":0},{"$f":"IF($M28=V$17, $H28, 0)","v":0},{"$f":"IF($M28=W$17, $H28, 0)","v":0},0,0,0,0,0,0,0,0,{"$f":"IF($M28=AF$17, $L28, 0)","v":0},0,null,{"$f":"IF($M28=AI$17, $H28, 0)","v":0},{"$f":"IF($M28=AJ$17, $H28, 0)","v":0},{"$f":"IF($M28=AK$17, $H28, 0)","v":0}]
["4. Grass Swale (4.2.5)",null,null,null,null,null,null,null,null,null,null,null,null,"Water volume associated with contributing area (cubic feet)",null,null,null,null,null,null,null,null,null,null,null,null,null,null,null,null,null,null,0]
["Grass Swale A/B Soils",null,null,{"$f":"1/12*(0.95*B30+$B$13*C30)*43560","v":0},"Reduce volume conveyed through grass swale by 0.2 inches.",0.2,{"$f":"U49","v":0},{"$f":"D30+G30","v":0},"N/A","N/A",{"$f":"IF((H30+(N30-G30))*F30>H30,H30,(H30+(N30-G30))*F30)","v":0},{"$f":"(D30-D30*F30)+IF((G30-N30*F30)<0,0,(G30-N30*F30))","v":0},null,{"$f":"AI49","v":0},null,null,{"$f":"IF($M30=Q$17, $L30, 0)","v":0},0,0,0,{"$f":"IF($M30=U$17, $H30, 0)","v":0},0,0,0,0,0,0,0,0,0,0,{"$f":"IF($M30=AF$17, $L30, 0)","v":0},0,null,{"$f":"IF($M30=AI$17, $H30, 0)","v":0},0,0]
["Grass Swale C/D Soils",null,null,{"$f":"1/12*(0.95*B31+$B$13*C31)*43560","v":0},"Reduce volume conveyed through grass swale by 0.1 inches.",0.1,{"$f":"V49","v":0},{"$f":"D31+G31","v":0},"N/A","N/A",{"$f":"IF((H31+(N31-G31))*F31>H31,H31,(H31+(N31-G31))*F31)","v":0},{"$f":"(D31-D31*F31)+IF((G31-N31*F31)<0,0,(G31-N31*F31))","v":0},null,{"$f":"AJ49","v":0},null,null,{"$f":"IF($M31=Q$17, $L31, 0)","v":0},0,0,0,0,0,0,0,0,0,0,0,0,0,0,{"$f":"IF($M31=AF$17, $L31, 0)","v":0},0,null,0,0,0]
["Grass Swale in C/D Soil with Soil Amendments",null,null,{"$f":"1/12*(0.95*B32+$B$13*C32)*43560","v":0},"Reduce volume conveyed through grass swale by 0.2 inches.",0.2,{"$f":"W49","v":0},{"$f":"D32+G32","v":0},"N/A","N/A",0,0,null,{"$f":"AK49","v":0},null,null,{"$f":"IF($M32=Q$17, $L32, 0)","v":0},0,0,0,0,0,0,0,0,0,0,0,0,0,0,{"$f":"IF($M32=AF$17, $L32, 0)","v":0},0,null,0,0,0]
["5. Water Quality Swale (4.2.3.A)",null,null,null,null,null,null,null,null,null,null,null,null,null,null,null,null,null,null,null,null,null,null,null,null,null,null,null,null,null,null,null,0]
["Water Quality Swale, Level 1",null,null,{"$f":"1/12*(0.95*B34+$B$13*C34)*43560","v":0},"Subtract 55% of the provided storage volume.",0.55000000000000004,{"$f":"X49","v":0},{"$f":"D34+G34","v":0},"N/A",null,{"$f":"IF(J34*F34<=H34,J34*F34,H34)","v":0},0,null,null,null,null,{"$f":"IF($M34=Q$17, $L34, 0)","v":0},0,0,0,{"$f":"IF($M34=U$17, $H34, 0)","v":0},0,0,0,0,0,0,0,0,0,0,{"$f":"IF($M34=AF$17, $L34, 0)","v":0},0,null,{"$f":"IF($M34=AI$17, $H34, 0)","v":0},0,0]
["Water Quality Swale, Level 2",null,null,{"$f":"1/12*(0.95*B35+$B$13*C35)*43560","v":0},"Subtract 100% of the provided storage volume.",1,{"$f":"Y49","v":0},{"$f":"D35+G35","v":0},"N/A",null,{"$f":"IF(J35*F35<=H35,J35*F35,H35)","v":0},0,null,null,null,null,{"$f":"IF($M35=Q$17, $L35, 0)","v":0},0,0,0,0,0,0,0,0,0,0,0,0,0,0,{"$f":"IF($M35=AF$17, $L35, 0)","v":0},0,null,0,0,0]
["6. Bioretention (4.2.3)",null,null,null,null,null,null,null,null,null,null,null,null,null,null,null,null,null,null,null,null,null,null,null,null,null,null,null,null,null,null,null,0]
["Bioretention, Level 1 or Urban Bioretention (4.2.3.B)",null,null,{"$f":"1/12*(0.95*B37+$B$13*C37)*43560","v":0},"Subtract 60% of the provided storage volume.",0.6,{"$f":"Z49","v":0},{"$f":"D37+G37","v":0},"N/A",null,{"$f":"IF(J37*F37<=H37,J37*F37,H37)","v":0},0,null,null,null,null,{"$f":"IF($M37=Q$17, $L37, 0)","v":0},0,0,0,{"$f":"IF($M37=U$17, $H37, 0)","v":0},0,0,0,0,0,0,0,0,0,0,{"$f":"IF($M37=AF$17, $L37, 0)","v":0},0,null,{"$f":"IF($M37=AI$17, $H37, 0)","v":0},0,0]
["Bioretention, Level 2",null,null,{"$f":"1/12*(0.95*B38+$B$13*C38)*43560","v":0},"Subtract 100% of the provided storage volume.",1,{"$f":"AA49","v":0},{"$f":"D38+G38","v":0},"N/A",null,{"$f":"IF(J38*F38<=H38,J38*F38,H38)","v":0},0,null,null,null,null,0,0,0,0,0,0,0,0,0,0,0,0,0,0,{"$f":"IF($M38=AE$17, $L38, 0)","v":0},{"$f":"IF($M38=AF$17, $L38, 0)","v":0},0,null,0,0,0]
["7. Infiltration (4.2.6) or Regenerative Stormwater Conveyance (4.2.7)",null,null,null,null,null,null,null,null,null,null,null,null,null,null,null,null,null,null,null,null,null,null,null,null,null,null,null,null,null,null,null,0]
["Infiltration",null,null,{"$f":"1/12*(0.95*B40+$B$13*C40)*43560","v":0},"Subtract 100% of the provided storage volume.",1,{"$f":"AB49","v":0},{"$f":"D40+G40","v":0},"N/A",null,{"$f":"IF(J40*F40<=H40,J40*F40,H40)","v":0},0,null,null,null,null,{"$f":"IF($M40=Q$17, $L40, 0)","v":0},{"$f":"IF($M40=R$17, $L40, 0)","v":0},0,0,{"$f":"IF($M40=U$17, $H40, 0)","v":0},{"$f":"IF($M40=V$17, $H40, 0)","v":0},{"$f":"IF($M40=W$17, $H40, 0)","v":0},0,0,0,0,0,0,0,0,{"$f":"IF($M40=AF$17, $L40, 0)","v":0},0,null,{"$f":"IF($M40=AI$17, $H40, 0)","v":0},{"$f":"IF($M40=AJ$17, $H40, 0)","v":0},{"$f":"IF($M40=AK$17, $H40, 0)","v":0}]
["8. Filtration Practice (4.2.10) or Stormwater Wetland (4.2.11)*",null,null,null,null,null,null,null,null,null,null,null,null,null,null,null,null,null,null,null,null,null,null,null,null,null,null,null,null,null,null,null,0]
["*Filtration Practice/Stormwater Wetland do NOT receive runoff reduction values, but do have associated pollutant removal values",null,null,{"$f":"1/12*(0.95*B42+$B$13*C42)*43560","v":0},"0% runoff reduction",0,{"$f":"AC49","v":0},{"$f":"D42+G42","v":0},"N/A",{"$f":"0.1*H42","v":0},{"$f":"IF(J42*F42<=H42,J42*F42,H42)","v":0},0,null,null,null,null,{"$f":"IF($M42=Q$17, $L42, 0)","v":0},{"$f":"IF($M42=R$17, $L42, 0)","v":0},0,0,{"$f":"IF($M42=U$17, $H42, 0)","v":0},0,0,0,0,0,0,0,0,0,0,{"$f":"IF($M42=AF$17, $L42, 0)","v":0},0,null,{"$f":"IF($M42=AI$17, $H42, 0)","v":0},0,0]
["9. Sheetflow to Filter/Conservation Area (4.2.1)",null,null,null,null,null,null,null,null,null,null,null,null,null,null,null,{"$f":"IF($M43=Q$17, $L43, 0)","v":0},0,0,0,null,null,null,0,0,0,0,0,0,0,0,0,0]
["Sheetflow to Conservation Area with A/B Soils",null,null,{"$f":"1/12*(0.95*B44+$B$13*C44)*43560","v":0},"Reduce volume conveyed to conservation area by 9 cu. ft per each 100 sq. ft. of conservation area.","N/A",{"$f":"AD49","v":0},{"$f":"D44+G44","v":0},null,"N/A",{"$f":"IF(I44*0.09<=H44,I44*0.09,H44)","v":0},0,null,null,null,null,0,0,0,0,0,0,0,0,0,0,0,0,0,0,0,0,0,null,0,0,0]
["Sheetflow to Conservation Area with C/D Soils",null,null,{"$f":"1/12*(0.95*B45+$B$13*C45)*43560","v":0},"Reduce volume conveyed to conservation area by 4 cu. ft per each 100 sq. ft. of conservation area.","N/A",{"$f":"AE49","v":0},{"$f":"D45+G45","v":0},null,"N/A",{"$f":"IF(I45*0.04<=H45,I45*0.04,H45)","v":0},0,null,null,null,null,0,0,0,0,{"$f":"IF($M45=U$17, $H45, 0)","v":0},0,0,0,0,0,0,0,0,0,0,0,0,null,0,0,0]
["Sheetflow to Vegetated Filter Strip in A/B Soils or Compost Amended C/D Soils",null,null,{"$f":"1/12*(0.95*B46+$B$13*C46)*43560","v":0},"Reduce volume conveyed to conservation area by 6 cu. ft per each 100 sq. ft. of filter strip.","N/A",{"$f":"AF49","v":0},{"$f":"D46+G46","v":0},null,"N/A",{"$f":"IF(I46*0.06<=H46,I46*0.06,H46)","v":0},0,null,null,null,null,0,0,0,0,0,0,0,0,0,0,0,0,0,0,0,0,0,null,0,0,0]
["Sheet flow to Vegetated Filter Strip in C/D Soils",null,null,{"$f":"1/12*(0.95*B47+$B$13*C47)*43560","v":0},"Reduce volume conveyed to conservation area by 3 cu. ft per each 100 sq. ft. of filter strip.","N/A",{"$f":"AG49","v":0},{"$f":"D47+G47","v":0},null,"N/A",{"$f":"IF(I47*0.03<=H47,I47*0.03,H47)","v":0},0,null,null,null,null,0,0,0,0,0,0,0,0,0,0,0,0,0,0,0,0,0,null,0,0,0]
["Totals",{"$f":"IF(SUM(B17:B47)>F10,\"Please Check the Contributing Areas: \" &SUM(B17:B47)-F10&\" acre Over\",SUM(B17:B47))","v":0},{"$f":"IF(SUM(C17:C47)>F9,\"Please Check the Contributing Areas: \" &SUM(C17:C47)-F9&\" acre Over\",SUM(C17:C47))","v":0},null,null,null,null,null,null,"Runoff Reduction Volume Achieved for Drainage Area A:",{"$f":"SUM(K17:K47)","v":0},"See Runoff Reduction Summary Tab for Detailed Results"]
[null,null,null,null,null,null,null,null,null,"Runoff Reduction Volume Balance for Total Site",{"$f":"ROUND('Site Data'!B88-'D.A. A'!K48-'D.A. B'!K48-'D.A. C'!K48-'D.A. D'!K48-'D.A. E'!K48,0)","v":0},{"$f":"IF(ROUND('Site Data'!B88-'D.A. A'!K48-'D.A. B'!K48-'D.A. C'!K48-'D.A. D'!K48-'D.A. E'!K48,0)<0,\"More Credit than needed has been provided\",\"\")","v":""},null,null,null,"Totals",{"$f":"SUM(Q17:Q48)","v":0},0,0,0,0,0,0,0,0,0,0,0,0,0,0,0,0,null,{"$f":"SUM(AI17:AI48)","v":0},0,0]
[]
[]
[]
[]
["Downstream Options"]
[{"$f":"A21","v":"Simple Disconnection to A/B Soils or Soil-Amended Filter Path in C/D Soils (4.2.2, Appendix D)"}]
[{"$f":"A22","v":"Simple Disconnection to C/D Soils (4.2.2)"}]
["To Residential Rain Garden (4.2.3.C)"]
[{"$f":"A24","v":"To Rainwater Harvesting (4.2.8)"}]
[{"$f":"A30","v":"Grass Swale A/B Soils"}]
[{"$f":"A31","v":"Grass Swale C/D Soils"}]
[{"$f":"A32","v":"Grass Swale in C/D Soil with Soil Amendments"}]
[{"$f":"A34","v":"Water Quality Swale, Level 1"}]
[{"$f":"A35","v":"Water Quality Swale, Level 2"}]
[{"$f":"A37","v":"Bioretention, Level 1 or Urban Bioretention (4.2.3.B)"}]
[{"$f":"A38","v":"Bioretention, Level 2"}]
[{"$f":"A40","v":"Infiltration"}]
[{"$f":"A42","v":"*Filtration Practice/Stormwater Wetland do NOT receive runoff reduction values, but do have associated pollutant removal values"}]
[{"$f":"A44","v":"Sheetflow to Conservation Area with A/B Soils"}]
[{"$f":"A45","v":"Sheetflow to Conservation Area with C/D Soils"}]
[{"$f":"A46","v":"Sheetflow to Vegetated Filter Strip in A/B Soils or Compost Amended C/D Soils"}]
[{"$f":"A47","v":"Sheet flow to Vegetated Filter Strip in C/D Soils"}]

{"sheet":"D.A. C","index":3,"n_rows":71,"n_cols":37,"rows_kept":71,"cut":false,"hidden":false,"merged":[[0,0,0,4]]}
["West Virginia MS4 Stormwater Compliance Spreadsheet v2.0; April 2013"]
[]
["Drainage Area C"]
[]
[]
["Drainage Area C Post-Development Land Cover (acres)"]
["Land Cover Type","HSG A soils","HSG B Soils","HSG C Soils","HSG D Soils","Totals"]
["Forest/Preserved Open Space",{"$f":"'Site Data'!B31","v":0},{"$f":"'Site Data'!C31","v":0},{"$f":"'Site Data'!D31","v":0},{"$f":"'Site Data'!E31","v":0},{"$f":"SUM(B8:E8)","v":0},null,{"$f":"\"RRv Achieved for Drainage Area \"&RIGHT(A3,1)&\" (cubic feet)\"","v":"RRv Achieved for Drainage Area C (cubic feet)"},null,null,{"$f":"K48","v":0}]
["Managed Turf",{"$f":"'Site Data'!B32","v":0},{"$f":"'Site Data'!C32","v":0},{"$f":"'Site Data'!D32","v":0},{"$f":"'Site Data'!E32","v":0},{"$f":"SUM(B9:E9)","v":0},null,{"$f":"\"RRv Balance for Drainage Area \"&RIGHT(A3,1)&\" (cubic feet)\"","v":"RRv Balance for Drainage Area C (cubic feet)"},null,null,{"$f":"'Site Data'!B86/12*B12*F11*43560-K8","v":0},{"$f":"IFERROR(L49,\"\")","v":""}]
["Impervious Cover ",{"$f":"'Site Data'!B33","v":0},{"$f":"'Site Data'!C33","v":0},{"$f":"'Site Data'!D33","v":0},{"$f":"'Site Data'!E33","v":0},{"$f":"SUM(B10:E10)","v":0},null,"RRv Balance for Total Site (cubic feet)",null,null,{"$f":"K49","v":0}]
[null,null,null,null,"Total",{"$f":"SUM(F8:F10)","v":0}]
["Rv(drainage area)",{"$f":"IFERROR(B13*F9/F11+B14*F10/F11,0)","v":0}]
["Rv(turf)",{"$f":"IF(F9>0,SUMPRODUCT(B9:E9,'Site Data'!B61:E61)/F9,0)","v":0}]
["Rv(impervious)",0.95]
[]
["Apply Runoff Reduction Practices"]
["Runoff Reduction Practice","Impervious Cover in Contributing Drainage Area (acres)","Managed Turf in Contributing Drainage Area (acres)","Volume Received by Practice      (cubic feet)","Description of Credit","% Credit","Volume Received from Upstream Practices     (cubic feet)","Total Volume Received by Practice       (cubic feet)","Disconnection Area of Practice (square feet)","Storage Volume Provided by Practice    (cubic feet)","Runoff Reduction (cubic feet)","Remaining Volume    (cubic feet)","Downstream Practice",null,null,null,{"$f":"A21","v":"Simple Disconnection to A/B Soils or Soil-Amended Filter Path in C/D Soils (4.2.2, Appendix D)"},{"$f":"A22","v":"Simple Disconnection to C/D Soils (4.2.2)"},{"$f":"A23","v":"To Residential Rain Garden (4.2.3.C)"},{"$f":"A24","v":"To Rainwater Harvesting (4.2.8)"},{"$f":"A30","v":"Grass Swale A/B Soils"},{"$f":"A31","v":"Grass Swale C/D Soils"},{"$f":"A32","v":"Grass Swale in C/D Soil with Soil Amendments"},{"$f":"A34","v":"Water Quality Swale, Level 1"},{"$f":"A35","v":"Water Quality Swale, Level 2"},{"$f":"A37","v":"Bioretention, Level 1 or Urban Bioretention (4.2.3.B)"},{"$f":"A38","v":"Bioretention, Level 2"},{"$f":"A40","v":"Infiltration"},{"$f":"A42","v":"*Filtration Practice/Stormwater Wetland do NOT receive runoff reduction values, but do have associated pollutant removal values"},{"$f":"A44","v":"Sheetflow to Conservation Area with A/B Soils"},{"$f":"A45","v":"Sheetflow to Conservation Area with C/D Soils"},{"$f":"A46","v":"Sheetflow to Vegetated Filter Strip in A/B Soils or Compost Amended C/D Soils"},{"$f":"A47","v":"Sheet flow to Vegetated Filter Strip in C/D Soils"},null,{"$f":"A30","v":"Grass Swale A/B Soils"},{"$f":"A31","v":"Grass Swale C/D Soils"},{"$f":"A32","v":"Grass Swale in C/D Soil with Soil Amendments"}]
["1. Vegetated Roof (4.2.9)"]
["Vegetated Roof",null,"N/A",{"$f":"1/12*0.95*B19*43560","v":0},"Reduce volume conveyed through green roof by 100%.",1,"N/A",{"$f":"D19","v":0},"N/A",null,{"$f":"IF(J19*F19<=H19,J19*F19,H19)","v":0},{"$f":"H19-K19","v":0},null,null,null,null,{"$f":"IF($M19=Q$17, $L19, 0)","v":0},{"$f":"IF($M19=R$17, $L19, 0)","v":0},0,0,{"$f":"IF($M19=U$17, $H19, 0)","v":0},{"$f":"IF($M19=V$17, $H19, 0)","v":0},{"$f":"IF($M19=W$17, $H19, 0)","v":0},0,0,0,0,0,0,0,0,{"$f":"IF($M19=AF$17, $L19, 0)","v":0},{"$f":"IF($M19=AG$17, $L19, 0)","v":0},null,{"$f":"IF($M19=AI$17, $H19, 0)","v":0},{"$f":"IF($M19=AJ$17, $H19, 0)","v":0},{"$f":"IF($M19=AK$17, $H19, 0)","v":0}]
["2. Impervious Surface Disconnection/Rooftop Practices ",null,null,null,null,null,null,null,null,null,null,null,null,null,null,null,null,null,null,null,null,null,null,null,null,null,null,null,null,null,null,null,{"$f":"IF($M20=AG$17, $L20, 0)","v":0}]
["Simple Disconnection to A/B Soils or Soil-Amended Filter Path in C/D Soils (4.2.2, Appendix D)",null,"N/A",{"$f":"1/12*0.95*B21*43560","v":0},"Reduce volume conveyed to conservation area by 4 cu. ft per each 100 sq. ft. of pervious receiving area.","N/A",{"$f":"Q49","v":0},{"$f":"D21+G21","v":0},null,"N/A",{"$f":"IF(I21*0.04<=H21,I21*0.04,H21)","v":0},0,null,null,null,null,{"$f":"IF($M21=Q$17, $L21, 0)","v":0},0,0,0,{"$f":"IF($M21=U$17, $H21, 0)","v":0},0,0,0,0,0,0,0,0,0,0,{"$f":"IF($M21=AF$17, $L21, 0)","v":0},0,null,{"$f":"IF($M21=AI$17, $H21, 0)","v":0},0,0]
["Simple Disconnection to C/D Soils (4.2.2)",null,"N/A",{"$f":"1/12*0.95*B22*43560","v":0},"Reduce volume conveyed to conservation area by 2 cu. ft per each 100 sq. ft. of pervious receiving area.","N/A",{"$f":"R49","v":0},{"$f":"D22+G22","v":0},null,"N/A",{"$f":"IF(I22*0.02<=H22,I22*0.02,H22)","v":0},0,null,null,null,null,{"$f":"IF($M22=Q$17, $L22, 0)","v":0},0,0,0,0,0,0,0,0,0,0,0,0,0,0,{"$f":"IF($M22=AF$17, $L22, 0)","v":0},0,null,0,0,0]
["To Residential Rain Garden (4.2.3.C)",null,"N/A",{"$f":"1/12*0.95*B23*43560","v":0},"60% volume reduction for the Design Volume of the practice",0.6,{"$f":"S49","v":0},{"$f":"D23+G23","v":0},"N/A",null,{"$f":"IF(J23*F23<=H23,J23*F23,H23)","v":0},0,null,null,null,null,{"$f":"IF($M23=Q$17, $L23, 0)","v":0},0,0,0,0,0,0,0,0,0,0,0,0,0,0,{"$f":"IF($M23=AF$17, $L23, 0)","v":0},0,null,0,0,0]
["To Rainwater Harvesting (4.2.8)",null,"N/A",{"$f":"1/12*0.95*B24*43560","v":0},"Subtract a variable % of the provided Design Volume based on annual  beneficial use (see Cistern Design Spreadsheet).",null,{"$f":"T49","v":0},{"$f":"D24+G24","v":0},"N/A",null,{"$f":"IF(J24*F24<=H24,J24*F24,H24)","v":0},0,null,null,null,null,{"$f":"IF($M24=Q$17, $L24, 0)","v":0},0,0,0,0,0,0,0,0,0,0,0,0,0,0,{"$f":"IF($M24=AF$17, $L24, 0)","v":0},0,null,0,0,0]
["3. Permeable Pavement (4.2.4)",null,null,null,null,null,null,null,null,null,null,null,null,"Storage Volume Provided by Sump Below Underdrain (cubic feet)","Storage Volume Provided by Reservoir Layer Above Underdrain (cubic feet)"]
["Permeable Pavement, Level 1",null,"N/A",{"$f":"1/12*0.95*B26*43560","v":0},"Subtract 45% of the provided storage volume.",0.45,"N/A",{"$f":"D26","v":0},"N/A",null,{"$f":"IF(J26*F26<=H26,J26*F26,H26)","v":0},0,null,null,null,null,{"$f":"IF($M26=Q$17, $L26, 0)","v":0},0,0,0,{"$f":"IF($M26=U$17, $H26, 0)","v":0},0,0,0,0,0,0,0,0,0,0,{"$f":"IF($M26=AF$17, $L26, 0)","v":0},0,null,{"$f":"IF($M26=AI$17, $H26, 0)","v":0},0,0]
["Permeable Pavement, Level 2 (infiltration)",null,"N/A",{"$f":"1/12*0.95*B27*43560","v":0},"Subtract 100% of the provided storage volume.",1,"N/A",{"$f":"D27","v":0},"N/A",null,{"$f":"IF(J27*F27<=H27,J27*F27,H27)","v":0},0,null,null,null,null,{"$f":"IF($M27=Q$17, $L27, 0)","v":0},0,0,0,0,0,0,0,0,0,0,0,0,0,0,{"$f":"IF($M27=AF$17, $L27, 0)","v":0},0,null,0,0,0]
["Permeable Pavement, Level 2 (infiltration & underdrain)",null,"N/A",{"$f":"1/12*0.95*B28*43560","v":0},"Subtract 100% of the provided storage volume of sump and 45% of the provided storage volume in reservoir layer.",null,"N/A",{"$f":"D28","v":0},"N/A",null,{"$f":"IF(N28*F27+O28*F26<=H28,N28*F27+O28*F26,H28)","v":0},0,null,null,null,null,{"$f":"IF($M28=Q$17, $L28, 0)","v":0},0,0,0,{"$f":"IF($M28=U$17, $H28, 0)","v":0},{"$f":"IF($M28=V$17, $H28, 0)","v":0},{"$f":"IF($M28=W$17, $H28, 0)","v":0},0,0,0,0,0,0,0,0,{"$f":"IF($M28=AF$17, $L28, 0)","v":0},0,null,{"$f":"IF($M28=AI$17, $H28, 0)","v":0},{"$f":"IF($M28=AJ$17, $H28, 0)","v":0},{"$f":"IF($M28=AK$17, $H28, 0)","v":0}]
["4. Grass Swale (4.2.5)",null,null,null,null,null,null,null,null,null,null,null,null,"Water volume associated with contributing area (cubic feet)",null,null,null,null,null,null,null,null,null,null,null,null,null,null,null,null,null,null,0]
["Grass Swale A/B Soils",null,null,{"$f":"1/12*(0.95*B30+$B$13*C30)*43560","v":0},"Reduce volume conveyed through grass swale by 0.2 inches.",0.2,{"$f":"U49","v":0},{"$f":"D30+G30","v":0},"N/A","N/A",{"$f":"IF((H30+(N30-G30))*F30>H30,H30,(H30+(N30-G30))*F30)","v":0},{"$f":"(D30-D30*F30)+IF((G30-N30*F30)<0,0,(G30-N30*F30))","v":0},null,{"$f":"AI49","v":0},null,null,{"$f":"IF($M30=Q$17, $L30, 0)","v":0},0,0,0,{"$f":"IF($M30=U$17, $H30, 0)","v":0},0,0,0,0,0,0,0,0,0,0,{"$f":"IF($M30=AF$17, $L30, 0)","v":0},0,null,{"$f":"IF($M30=AI$17, $H30, 0)","v":0},0,0]
["Grass Swale C/D Soils",null,null,{"$f":"1/12*(0.95*B31+$B$13*C31)*43560","v":0},"Reduce volume conveyed through grass swale by 0.1 inches.",0.1,{"$f":"V49","v":0},{"$f":"D31+G31","v":0},"N/A","N/A",{"$f":"IF((H31+(N31-G31))*F31>H31,H31,(H31+(N31-G31))*F31)","v":0},{"$f":"(D31-D31*F31)+IF((G31-N31*F31)<0,0,(G31-N31*F31))","v":0},null,{"$f":"AJ49","v":0},null,null,{"$f":"IF($M31=Q$17, $L31, 0)","v":0},0,0,0,0,0,0,0,0,0,0,0,0,0,0,{"$f":"IF($M31=AF$17, $L31, 0)","v":0},0,null,0,0,0]
["Grass Swale in C/D Soil with Soil Amendments",null,null,{"$f":"1/12*(0.95*B32+$B$13*C32)*43560","v":0},"Reduce volume conveyed through grass swale by 0.2 inches.",0.2,{"$f":"W49","v":0},{"$f":"D32+G32","v":0},"N/A","N/A",0,0,null,{"$f":"AK49","v":0},null,null,{"$f":"IF($M32=Q$17, $L32, 0)","v":0},0,0,0,0,0,0,0,0,0,0,0,0,0,0,{"$f":"IF($M32=AF$17, $L32, 0)","v":0},0,null,0,0,0]
["5. Water Quality Swale (4.2.3.A)",null,null,null,null,null,null,null,null,null,null,null,null,null,null,null,null,null,null,null,null,null,null,null,null,null,null,null,null,null,null,null,0]
["Water Quality Swale, Level 1",null,null,{"$f":"1/12*(0.95*B34+$B$13*C34)*43560","v":0},"Subtract 55% of the provided storage volume.",0.55000000000000004,{"$f":"X49","v":0},{"$f":"D34+G34","v":0},"N/A",null,{"$f":"IF(J34*F34<=H34,J34*F34,H34)","v":0},0,null,null,null,null,{"$f":"IF($M34=Q$17, $L34, 0)","v":0},0,0,0,{"$f":"IF($M34=U$17, $H34, 0)","v":0},0,0,0,0,0,0,0,0,0,0,{"$f":"IF($M34=AF$17, $L34, 0)","v":0},0,null,{"$f":"IF($M34=AI$17, $H34, 0)","v":0},0,0]
["Water Quality Swale, Level 2",null,null,{"$f":"1/12*(0.95*B35+$B$13*C35)*43560","v":0},"Subtract 100% of the provided storage volume.",1,{"$f":"Y49","v":0},{"$f":"D35+G35","v":0},"N/A",null,{"$f":"IF(J35*F35<=H35,J35*F35,H35)","v":0},0,null,null,null,null,{"$f":"IF($M35=Q$17, $L35, 0)","v":0},0,0,0,0,0,0,0,0,0,0,0,0,0,0,{"$f":"IF($M35=AF$17, $L35, 0)","v":0},0,null,0,0,0]
["6. Bioretention (4.2.3)",null,null,null,null,null,null,null,null,null,null,null,null,null,null,null,null,null,null,null,null,null,null,null,null,null,null,null,null,null,null,null,0]
["Bioretention, Level 1 or Urban Bioretention (4.2.3.B)",null,null,{"$f":"1/12*(0.95*B37+$B$13*C37)*43560","v":0},"Subtract 60% of the provided storage volume.",0.6,{"$f":"Z49","v":0},{"$f":"D37+G37","v":0},"N/A",null,{"$f":"IF(J37*F37<=H37,J37*F37,H37)","v":0},0,null,null,null,null,{"$f":"IF($M37=Q$17, $L37, 0)","v":0},0,0,0,{"$f":"IF($M37=U$17, $H37, 0)","v":0},0,0,0,0,0,0,0,0,0,0,{"$f":"IF($M37=AF$17, $L37, 0)","v":0},0,null,{"$f":"IF($M37=AI$17, $H37, 0)","v":0},0,0]
["Bioretention, Level 2",null,null,{"$f":"1/12*(0.95*B38+$B$13*C38)*43560","v":0},"Subtract 100% of the provided storage volume.",1,{"$f":"AA49","v":0},{"$f":"D38+G38","v":0},"N/A",null,{"$f":"IF(J38*F38<=H38,J38*F38,H38)","v":0},0,null,null,null,null,0,0,0,0,0,0,0,0,0,0,0,0,0,0,{"$f":"IF($M38=AE$17, $L38, 0)","v":0},{"$f":"IF($M38=AF$17, $L38, 0)","v":0},0,null,0,0,0]
["7. Infiltration (4.2.6) or Regenerative Stormwater Conveyance (4.2.7)",null,null,null,null,null,null,null,null,null,null,null,null,null,null,null,null,null,null,null,null,null,null,null,null,null,null,null,null,null,null,null,0]
["Infiltration",null,null,{"$f":"1/12*(0.95*B40+$B$13*C40)*43560","v":0},"Subtract 100% of the provided storage volume.",1,{"$f":"AB49","v":0},{"$f":"D40+G40","v":0},"N/A",null,{"$f":"IF(J40*F40<=H40,J40*F40,H40)","v":0},0,null,null,null,null,{"$f":"IF($M40=Q$17, $L40, 0)","v":0},{"$f":"IF($M40=R$17, $L40, 0)","v":0},0,0,{"$f":"IF($M40=U$17, $H40, 0)","v":0},{"$f":"IF($M40=V$17, $H40, 0)","v":0},{"$f":"IF($M40=W$17, $H40, 0)","v":0},0,0,0,0,0,0,0,0,{"$f":"IF($M40=AF$17, $L40, 0)","v":0},0,null,{"$f":"IF($M40=AI$17, $H40, 0)","v":0},{"$f":"IF($M40=AJ$17, $H40, 0)","v":0},{"$f":"IF($M40=AK$17, $H40, 0)","v":0}]
["8. Filtration Practice (4.2.10) or Stormwater Wetland (4.2.11)*",null,null,null,null,null,null,null,null,null,null,null,null,null,null,null,null,null,null,null,null,null,null,null,null,null,null,null,null,null,null,null,0]
["*Filtration Practice/Stormwater Wetland do NOT receive runoff reduction values, but do have associated pollutant removal values",null,null,{"$f":"1/12*(0.95*B42+$B$13*C42)*43560","v":0},"0% runoff reduction",0,{"$f":"AC49","v":0},{"$f":"D42+G42","v":0},"N/A",{"$f":"0.1*H42","v":0},{"$f":"IF(J42*F42<=H42,J42*F42,H42)","v":0},0,null,null,null,null,{"$f":"IF($M42=Q$17, $L42, 0)","v":0},{"$f":"IF($M42=R$17, $L42, 0)","v":0},0,0,{"$f":"IF($M42=U$17, $H42, 0)","v":0},0,0,0,0,0,0,0,0,0,0,{"$f":"IF($M42=AF$17, $L42, 0)","v":0},0,null,{"$f":"IF($M42=AI$17, $H42, 0)","v":0},0,0]
["9. Sheetflow to Filter/Conservation Area (4.2.1)",null,null,null,null,null,null,null,null,null,null,null,null,null,null,null,{"$f":"IF($M43=Q$17, $L43, 0)","v":0},0,0,0,null,null,null,0,0,0,0,0,0,0,0,0,0]
["Sheetflow to Conservation Area with A/B Soils",null,null,{"$f":"1/12*(0.95*B44+$B$13*C44)*43560","v":0},"Reduce volume conveyed to conservation area by 9 cu. ft per each 100 sq. ft. of conservation area.","N/A",{"$f":"AD49","v":0},{"$f":"D44+G44","v":0},null,"N/A",{"$f":"IF(I44*0.09<=H44,I44*0.09,H44)","v":0},0,null,null,null,null,0,0,0,0,0,0,0,0,0,0,0,0,0,0,0,0,0,null,0,0,0]
["Sheetflow to Conservation Area with C/D Soils",null,null,{"$f":"1/12*(0.95*B45+$B$13*C45)*43560","v":0},"Reduce volume conveyed to conservation area by 4 cu. ft per each 100 sq. ft. of conservation area.","N/A",{"$f":"AE49","v":0},{"$f":"D45+G45","v":0},null,"N/A",{"$f":"IF(I45*0.04<=H45,I45*0.04,H45)","v":0},0,null,null,null,null,0,0,0,0,{"$f":"IF($M45=U$17, $H45, 0)","v":0},0,0,0,0,0,0,0,0,0,0,0,0,null,0,0,0]
["Sheetflow to Vegetated Filter Strip in A/B Soils or Compost Amended C/D Soils",null,null,{"$f":"1/12*(0.95*B46+$B$13*C46)*43560","v":0},"Reduce volume conveyed to conservation area by 6 cu. ft per each 100 sq. ft. of filter strip.","N/A",{"$f":"AF49","v":0},{"$f":"D46+G46","v":0},null,"N/A",{"$f":"IF(I46*0.06<=H46,I46*0.06,H46)","v":0},0,null,null,null,null,0,0,0,0,0,0,0,0,0,0,0,0,0,0,0,0,0,null,0,0,0]
["Sheet flow to Vegetated Filter Strip in C/D Soils",null,null,{"$f":"1/12*(0.95*B47+$B$13*C47)*43560","v":0},"Reduce volume conveyed to conservation area by 3 cu. ft per each 100 sq. ft. of filter strip.","N/A",{"$f":"AG49","v":0},{"$f":"D47+G47","v":0},null,"N/A",{"$f":"IF(I47*0.03<=H47,I47*0.03,H47)","v":0},0,null,null,null,null,0,0,0,0,0,0,0,0,0,0,0,0,0,0,0,0,0,null,0,0,0]
["Totals",{"$f":"IF(SUM(B17:B47)>F10,\"Please Check the Contributing Areas: \" &SUM(B17:B47)-F10&\" acre Over\",SUM(B17:B47))","v":0},{"$f":"IF(SUM(C17:C47)>F9,\"Please Check the Contributing Areas: \" &SUM(C17:C47)-F9&\" acre Over\",SUM(C17:C47))","v":0},null,null,null,null,null,null,"Runoff Reduction Volume Achieved for Drainage Area A:",{"$f":"SUM(K17:K47)","v":0},"See Runoff Reduction Summary Tab for Detailed Results"]
[null,null,null,null,null,null,null,null,null,"Runoff Reduction Volume Balance for Total Site",{"$f":"ROUND('Site Data'!B88-'D.A. A'!K48-'D.A. B'!K48-'D.A. C'!K48-'D.A. D'!K48-'D.A. E'!K48,0)","v":0},{"$f":"IF(ROUND('Site Data'!B88-'D.A. A'!K48-'D.A. B'!K48-'D.A. C'!K48-'D.A. D'!K48-'D.A. E'!K48,0)<0,\"More Credit than needed has been provided\",\"\")","v":""},null,null,null,"Totals",{"$f":"SUM(Q17:Q48)","v":0},0,0,0,0,0,0,0,0,0,0,0,0,0,0,0,0,null,{"$f":"SUM(AI17:AI48)","v":0},0,0]
[]
[]
[]
[]
["Downstream Options"]
[{"$f":"A21","v":"Simple Disconnection to A/B Soils or Soil-Amended Filter Path in C/D Soils (4.2.2, Appendix D)"}]
[{"$f":"A22","v":"Simple Disconnection to C/D Soils (4.2.2)"}]
["To Residential Rain Garden (4.2.3.C)"]
[{"$f":"A24","v":"To Rainwater Harvesting (4.2.8)"}]
[{"$f":"A30","v":"Grass Swale A/B Soils"}]
[{"$f":"A31","v":"Grass Swale C/D Soils"}]
[{"$f":"A32","v":"Grass Swale in C/D Soil with Soil Amendments"}]
[{"$f":"A34","v":"Water Quality Swale, Level 1"}]
[{"$f":"A35","v":"Water Quality Swale, Level 2"}]
[{"$f":"A37","v":"Bioretention, Level 1 or Urban Bioretention (4.2.3.B)"}]
[{"$f":"A38","v":"Bioretention, Level 2"}]
[{"$f":"A40","v":"Infiltration"}]
[{"$f":"A42","v":"*Filtration Practice/Stormwater Wetland do NOT receive runoff reduction values, but do have associated pollutant removal values"}]
[{"$f":"A44","v":"Sheetflow to Conservation Area with A/B Soils"}]
[{"$f":"A45","v":"Sheetflow to Conservation Area with C/D Soils"}]
[{"$f":"A46","v":"Sheetflow to Vegetated Filter Strip in A/B Soils or Compost Amended C/D Soils"}]
[{"$f":"A47","v":"Sheet flow to Vegetated Filter Strip in C/D Soils"}]

{"sheet":"D.A. D","index":4,"n_rows":71,"n_cols":37,"rows_kept":71,"cut":false,"hidden":false,"merged":[[0,0,0,4]]}
["West Virginia MS4 Stormwater Compliance Spreadsheet v2.0; April 2013"]
[]
["Drainage Area D"]
[]
[]
["Drainage Area D Post-Development Land Cover (acres)"]
["Land Cover Type","HSG A soils","HSG B Soils","HSG C Soils","HSG D Soils","Totals"]
["Forest/Preserved Open Space",{"$f":"'Site Data'!B38","v":0},{"$f":"'Site Data'!C38","v":0},{"$f":"'Site Data'!D38","v":0},{"$f":"'Site Data'!E38","v":0},{"$f":"SUM(B8:E8)","v":0},null,{"$f":"\"RRv Achieved for Drainage Area \"&RIGHT(A3,1)&\" (cubic feet)\"","v":"RRv Achieved for Drainage Area D (cubic feet)"},null,null,{"$f":"K48","v":0}]
["Managed Turf",{"$f":"'Site Data'!B39","v":0},{"$f":"'Site Data'!C39","v":0},{"$f":"'Site Data'!D39","v":0},{"$f":"'Site Data'!E39","v":0},{"$f":"SUM(B9:E9)","v":0},null,{"$f":"\"RRv Balance for Drainage Area \"&RIGHT(A3,1)&\" (cubic feet)\"","v":"RRv Balance for Drainage Area D (cubic feet)"},null,null,{"$f":"'Site Data'!B86/12*B12*F11*43560-K8","v":0},{"$f":"IFERROR(L49,\"\")","v":""}]
["Impervious Cover ",{"$f":"'Site Data'!B40","v":0},{"$f":"'Site Data'!C40","v":0},{"$f":"'Site Data'!D40","v":0},{"$f":"'Site Data'!E40","v":0},{"$f":"SUM(B10:E10)","v":0},null,"RRv Balance for Total Site (cubic feet)",null,null,{"$f":"K49","v":0}]
[null,null,null,null,"Total",{"$f":"SUM(F8:F10)","v":0}]
["Rv(drainage area)",{"$f":"IFERROR(B13*F9/F11+B14*F10/F11,0)","v":0}]
["Rv(turf)",{"$f":"IF(F9>0,SUMPRODUCT(B9:E9,'Site Data'!B61:E61)/F9,0)","v":0}]
["Rv(impervious)",0.95]
[]
["Apply Runoff Reduction Practices"]
["Runoff Reduction Practice","Impervious Cover in Contributing Drainage Area (acres)","Managed Turf in Contributing Drainage Area (acres)","Volume Received by Practice      (cubic feet)","Description of Credit","% Credit","Volume Received from Upstream Practices     (cubic feet)","Total Volume Received by Practice       (cubic feet)","Disconnection Area of Practice (square feet)","Storage Volume Provided by Practice    (cubic feet)","Runoff Reduction (cubic feet)","Remaining Volume    (cubic feet)","Downstream Practice",null,null,null,{"$f":"A21","v":"Simple Disconnection to A/B Soils or Soil-Amended Filter Path in C/D Soils (4.2.2, Appendix D)"},{"$f":"A22","v":"Simple Disconnection to C/D Soils (4.2.2)"},{"$f":"A23","v":"To Residential Rain Garden (4.2.3.C)"},{"$f":"A24","v":"To Rainwater Harvesting (4.2.8)"},{"$f":"A30","v":"Grass Swale A/B Soils"},{"$f":"A31","v":"Grass Swale C/D Soils"},{"$f":"A32","v":"Grass Swale in C/D Soil with Soil Amendments"},{"$f":"A34","v":"Water Quality Swale, Level 1"},{"$f":"A35","v":"Water Quality Swale, Level 2"},{"$f":"A37","v":"Bioretention, Level 1 or Urban Bioretention (4.2.3.B)"},{"$f":"A38","v":"Bioretention, Level 2"},{"$f":"A40","v":"Infiltration"},{"$f":"A42","v":"*Filtration Practice/Stormwater Wetland do NOT receive runoff reduction values, but do have associated pollutant removal values"},{"$f":"A44","v":"Sheetflow to Conservation Area with A/B Soils"},{"$f":"A45","v":"Sheetflow to Conservation Area with C/D Soils"},{"$f":"A46","v":"Sheetflow to Vegetated Filter Strip in A/B Soils or Compost Amended C/D Soils"},{"$f":"A47","v":"Sheet flow to Vegetated Filter Strip in C/D Soils"},null,{"$f":"A30","v":"Grass Swale A/B Soils"},{"$f":"A31","v":"Grass Swale C/D Soils"},{"$f":"A32","v":"Grass Swale in C/D Soil with Soil Amendments"}]
["1. Vegetated Roof (4.2.9)"]
["Vegetated Roof",null,"N/A",{"$f":"1/12*0.95*B19*43560","v":0},"Reduce volume conveyed through green roof by 100%.",1,"N/A",{"$f":"D19","v":0},"N/A",null,{"$f":"IF(J19*F19<=H19,J19*F19,H19)","v":0},{"$f":"H19-K19","v":0},null,null,null,null,{"$f":"IF($M19=Q$17, $L19, 0)","v":0},{"$f":"IF($M19=R$17, $L19, 0)","v":0},0,0,{"$f":"IF($M19=U$17, $H19, 0)","v":0},{"$f":"IF($M19=V$17, $H19, 0)","v":0},{"$f":"IF($M19=W$17, $H19, 0)","v":0},0,0,0,0,0,0,0,0,{"$f":"IF($M19=AF$17, $L19, 0)","v":0},{"$f":"IF($M19=AG$17, $L19, 0)","v":0},null,{"$f":"IF($M19=AI$17, $H19, 0)","v":0},{"$f":"IF($M19=AJ$17, $H19, 0)","v":0},{"$f":"IF($M19=AK$17, $H19, 0)","v":0}]
["2. Impervious Surface Disconnection/Rooftop Practices ",null,null,null,null,null,null,null,null,null,null,null,null,null,null,null,null,null,null,null,null,null,null,null,null,null,null,null,null,null,null,null,{"$f":"IF($M20=AG$17, $L20, 0)","v":0}]
["Simple Disconnection to A/B Soils or Soil-Amended Filter Path in C/D Soils (4.2.2, Appendix D)",null,"N/A",{"$f":"1/12*0.95*B21*43560","v":0},"Reduce volume conveyed to conservation area by 4 cu. ft per each 100 sq. ft. of pervious receiving area.","N/A",{"$f":"Q49","v":0},{"$f":"D21+G21","v":0},null,"N/A",{"$f":"IF(I21*0.04<=H21,I21*0.04,H21)","v":0},0,null,null,null,null,{"$f":"IF($M21=Q$17, $L21, 0)","v":0},0,0,0,{"$f":"IF($M21=U$17, $H21, 0)","v":0},0,0,0,0,0,0,0,0,0,0,{"$f":"IF($M21=AF$17, $L21, 0)","v":0},0,null,{"$f":"IF($M21=AI$17, $H21, 0)","v":0},0,0]
["Simple Disconnection to C/D Soils (4.2.2)",null,"N/A",{"$f":"1/12*0.95*B22*43560","v":0},"Reduce volume conveyed to conservation area by 2 cu. ft per each 100 sq. ft. of pervious receiving area.","N/A",{"$f":"R49","v":0},{"$f":"D22+G22","v":0},null,"N/A",{"$f":"IF(I22*0.02<=H22,I22*0.02,H22)","v":0},0,null,null,null,null,{"$f":"IF($M22=Q$17, $L22, 0)","v":0},0,0,0,0,0,0,0,0,0,0,0,0,0,0,{"$f":"IF($M22=AF$17, $L22, 0)","v":0},0,null,0,0,0]
["To Residential Rain Garden (4.2.3.C)",null,"N/A",{"$f":"1/12*0.95*B23*43560","v":0},"60% volume reduction for the Design Volume of the practice",0.6,{"$f":"S49","v":0},{"$f":"D23+G23","v":0},"N/A",null,{"$f":"IF(J23*F23<=H23,J23*F23,H23)","v":0},0,null,null,null,null,{"$f":"IF($M23=Q$17, $L23, 0)","v":0},0,0,0,0,0,0,0,0,0,0,0,0,0,0,{"$f":"IF($M23=AF$17, $L23, 0)","v":0},0,null,0,0,0]
["To Rainwater Harvesting (4.2.8)",null,"N/A",{"$f":"1/12*0.95*B24*43560","v":0},"Subtract a variable % of the provided Design Volume based on annual  beneficial use (see Cistern Design Spreadsheet).",null,{"$f":"T49","v":0},{"$f":"D24+G24","v":0},"N/A",null,{"$f":"IF(J24*F24<=H24,J24*F24,H24)","v":0},0,null,null,null,null,{"$f":"IF($M24=Q$17, $L24, 0)","v":0},0,0,0,0,0,0,0,0,0,0,0,0,0,0,{"$f":"IF($M24=AF$17, $L24, 0)","v":0},0,null,0,0,0]
["3. Permeable Pavement (4.2.4)",null,null,null,null,null,null,null,null,null,null,null,null,"Storage Volume Provided by Sump Below Underdrain (cubic feet)","Storage Volume Provided by Reservoir Layer Above Underdrain (cubic feet)"]
["Permeable Pavement, Level 1",null,"N/A",{"$f":"1/12*0.95*B26*43560","v":0},"Subtract 45% of the provided storage volume.",0.45,"N/A",{"$f":"D26","v":0},"N/A",null,{"$f":"IF(J26*F26<=H26,J26*F26,H26)","v":0},0,null,null,null,null,{"$f":"IF($M26=Q$17, $L26, 0)","v":0},0,0,0,{"$f":"IF($M26=U$17, $H26, 0)","v":0},0,0,0,0,0,0,0,0,0,0,{"$f":"IF($M26=AF$17, $L26, 0)","v":0},0,null,{"$f":"IF($M26=AI$17, $H26, 0)","v":0},0,0]
["Permeable Pavement, Level 2 (infiltration)",null,"N/A",{"$f":"1/12*0.95*B27*43560","v":0},"Subtract 100% of the provided storage volume.",1,"N/A",{"$f":"D27","v":0},"N/A",null,{"$f":"IF(J27*F27<=H27,J27*F27,H27)","v":0},0,null,null,null,null,{"$f":"IF($M27=Q$17, $L27, 0)","v":0},0,0,0,0,0,0,0,0,0,0,0,0,0,0,{"$f":"IF($M27=AF$17, $L27, 0)","v":0},0,null,0,0,0]
["Permeable Pavement, Level 2 (infiltration & underdrain)",null,"N/A",{"$f":"1/12*0.95*B28*43560","v":0},"Subtract 100% of the provided storage volume of sump and 45% of the provided storage volume in reservoir layer.",null,"N/A",{"$f":"D28","v":0},"N/A",null,{"$f":"IF(N28*F27+O28*F26<=H28,N28*F27+O28*F26,H28)","v":0},0,null,null,null,null,{"$f":"IF($M28=Q$17, $L28, 0)","v":0},0,0,0,{"$f":"IF($M28=U$17, $H28, 0)","v":0},{"$f":"IF($M28=V$17, $H28, 0)","v":0},{"$f":"IF($M28=W$17, $H28, 0)","v":0},0,0,0,0,0,0,0,0,{"$f":"IF($M28=AF$17, $L28, 0)","v":0},0,null,{"$f":"IF($M28=AI$17, $H28, 0)","v":0},{"$f":"IF($M28=AJ$17, $H28, 0)","v":0},{"$f":"IF($M28=AK$17, $H28, 0)","v":0}]
["4. Grass Swale (4.2.5)",null,null,null,null,null,null,null,null,null,null,null,null,"Water volume associated with contributing area (cubic feet)",null,null,null,null,null,null,null,null,null,null,null,null,null,null,null,null,null,null,0]
["Grass Swale A/B Soils",null,null,{"$f":"1/12*(0.95*B30+$B$13*C30)*43560","v":0},"Reduce volume conveyed through grass swale by 0.2 inches.",0.2,{"$f":"U49","v":0},{"$f":"D30+G30","v":0},"N/A","N/A",{"$f":"IF((H30+(N30-G30))*F30>H30,H30,(H30+(N30-G30))*F30)","v":0},{"$f":"(D30-D30*F30)+IF((G30-N30*F30)<0,0,(G30-N30*F30))","v":0},null,{"$f":"AI49","v":0},null,null,{"$f":"IF($M30=Q$17, $L30, 0)","v":0},0,0,0,{"$f":"IF($M30=U$17, $H30, 0)","v":0},0,0,0,0,0,0,0,0,0,0,{"$f":"IF($M30=AF$17, $L30, 0)","v":0},0,null,{"$f":"IF($M30=AI$17, $H30, 0)","v":0},0,0]
["Grass Swale C/D Soils",null,null,{"$f":"1/12*(0.95*B31+$B$13*C31)*43560","v":0},"Reduce volume conveyed through grass swale by 0.1 inches.",0.1,{"$f":"V49","v":0},{"$f":"D31+G31","v":0},"N/A","N/A",{"$f":"IF((H31+(N31-G31))*F31>H31,H31,(H31+(N31-G31))*F31)","v":0},{"$f":"(D31-D31*F31)+IF((G31-N31*F31)<0,0,(G31-N31*F31))","v":0},null,{"$f":"AJ49","v":0},null,null,{"$f":"IF($M31=Q$17, $L31, 0)","v":0},0,0,0,0,0,0,0,0,0,0,0,0,0,0,{"$f":"IF($M31=AF$17, $L31, 0)","v":0},0,null,0,0,0]
["Grass Swale in C/D Soil with Soil Amendments",null,null,{"$f":"1/12*(0.95*B32+$B$13*C32)*43560","v":0},"Reduce volume conveyed through grass swale by 0.2 inches.",0.2,{"$f":"W49","v":0},{"$f":"D32+G32","v":0},"N/A","N/A",0,0,null,{"$f":"AK49","v":0},null,null,{"$f":"IF($M32=Q$17, $L32, 0)","v":0},0,0,0,0,0,0,0,0,0,0,0,0,0,0,{"$f":"IF($M32=AF$17, $L32, 0)","v":0},0,null,0,0,0]
["5. Water Quality Swale (4.2.3.A)",null,null,null,null,null,null,null,null,null,null,null,null,null,null,null,null,null,null,null,null,null,null,null,null,null,null,null,null,null,null,null,0]
["Water Quality Swale, Level 1",null,null,{"$f":"1/12*(0.95*B34+$B$13*C34)*43560","v":0},"Subtract 55% of the provided storage volume.",0.55000000000000004,{"$f":"X49","v":0},{"$f":"D34+G34","v":0},"N/A",null,{"$f":"IF(J34*F34<=H34,J34*F34,H34)","v":0},0,null,null,null,null,{"$f":"IF($M34=Q$17, $L34, 0)","v":0},0,0,0,{"$f":"IF($M34=U$17, $H34, 0)","v":0},0,0,0,0,0,0,0,0,0,0,{"$f":"IF($M34=AF$17, $L34, 0)","v":0},0,null,{"$f":"IF($M34=AI$17, $H34, 0)","v":0},0,0]
["Water Quality Swale, Level 2",null,null,{"$f":"1/12*(0.95*B35+$B$13*C35)*43560","v":0},"Subtract 100% of the provided storage volume.",1,{"$f":"Y49","v":0},{"$f":"D35+G35","v":0},"N/A",null,{"$f":"IF(J35*F35<=H35,J35*F35,H35)","v":0},0,null,null,null,null,{"$f":"IF($M35=Q$17, $L35, 0)","v":0},0,0,0,0,0,0,0,0,0,0,0,0,0,0,{"$f":"IF($M35=AF$17, $L35, 0)","v":0},0,null,0,0,0]
["6. Bioretention (4.2.3)",null,null,null,null,null,null,null,null,null,null,null,null,null,null,null,null,null,null,null,null,null,null,null,null,null,null,null,null,null,null,null,0]
["Bioretention, Level 1 or Urban Bioretention (4.2.3.B)",null,null,{"$f":"1/12*(0.95*B37+$B$13*C37)*43560","v":0},"Subtract 60% of the provided storage volume.",0.6,{"$f":"Z49","v":0},{"$f":"D37+G37","v":0},"N/A",null,{"$f":"IF(J37*F37<=H37,J37*F37,H37)","v":0},0,null,null,null,null,{"$f":"IF($M37=Q$17, $L37, 0)","v":0},0,0,0,{"$f":"IF($M37=U$17, $H37, 0)","v":0},0,0,0,0,0,0,0,0,0,0,{"$f":"IF($M37=AF$17, $L37, 0)","v":0},0,null,{"$f":"IF($M37=AI$17, $H37, 0)","v":0},0,0]
["Bioretention, Level 2",null,null,{"$f":"1/12*(0.95*B38+$B$13*C38)*43560","v":0},"Subtract 100% of the provided storage volume.",1,{"$f":"AA49","v":0},{"$f":"D38+G38","v":0},"N/A",null,{"$f":"IF(J38*F38<=H38,J38*F38,H38)","v":0},0,null,null,null,null,0,0,0,0,0,0,0,0,0,0,0,0,0,0,{"$f":"IF($M38=AE$17, $L38, 0)","v":0},{"$f":"IF($M38=AF$17, $L38, 0)","v":0},0,null,0,0,0]
["7. Infiltration (4.2.6) or Regenerative Stormwater Conveyance (4.2.7)",null,null,null,null,null,null,null,null,null,null,null,null,null,null,null,null,null,null,null,null,null,null,null,null,null,null,null,null,null,null,null,0]
["Infiltration",null,null,{"$f":"1/12*(0.95*B40+$B$13*C40)*43560","v":0},"Subtract 100% of the provided storage volume.",1,{"$f":"AB49","v":0},{"$f":"D40+G40","v":0},"N/A",null,{"$f":"IF(J40*F40<=H40,J40*F40,H40)","v":0},0,null,null,null,null,{"$f":"IF($M40=Q$17, $L40, 0)","v":0},{"$f":"IF($M40=R$17, $L40, 0)","v":0},0,0,{"$f":"IF($M40=U$17, $H40, 0)","v":0},{"$f":"IF($M40=V$17, $H40, 0)","v":0},{"$f":"IF($M40=W$17, $H40, 0)","v":0},0,0,0,0,0,0,0,0,{"$f":"IF($M40=AF$17, $L40, 0)","v":0},0,null,{"$f":"IF($M40=AI$17, $H40, 0)","v":0},{"$f":"IF($M40=AJ$17, $H40, 0)","v":0},{"$f":"IF($M40=AK$17, $H40, 0)","v":0}]
["8. Filtration Practice (4.2.10) or Stormwater Wetland (4.2.11)*",null,null,null,null,null,null,null,null,null,null,null,null,null,null,null,null,null,null,null,null,null,null,null,null,null,null,null,null,null,null,null,0]
["*Filtration Practice/Stormwater Wetland do NOT receive runoff reduction values, but do have associated pollutant removal values",null,null,{"$f":"1/12*(0.95*B42+$B$13*C42)*43560","v":0},"0% runoff reduction",0,{"$f":"AC49","v":0},{"$f":"D42+G42","v":0},"N/A",{"$f":"0.1*H42","v":0},{"$f":"IF(J42*F42<=H42,J42*F42,H42)","v":0},0,null,null,null,null,{"$f":"IF($M42=Q$17, $L42, 0)","v":0},{"$f":"IF($M42=R$17, $L42, 0)","v":0},0,0,{"$f":"IF($M42=U$17, $H42, 0)","v":0},0,0,0,0,0,0,0,0,0,0,{"$f":"IF($M42=AF$17, $L42, 0)","v":0},0,null,{"$f":"IF($M42=AI$17, $H42, 0)","v":0},0,0]
["9. Sheetflow to Filter/Conservation Area (4.2.1)",null,null,null,null,null,null,null,null,null,null,null,null,null,null,null,{"$f":"IF($M43=Q$17, $L43, 0)","v":0},0,0,0,null,null,null,0,0,0,0,0,0,0,0,0,0]
["Sheetflow to Conservation Area with A/B Soils",null,null,{"$f":"1/12*(0.95*B44+$B$13*C44)*43560","v":0},"Reduce volume conveyed to conservation area by 9 cu. ft per each 100 sq. ft. of conservation area.","N/A",{"$f":"AD49","v":0},{"$f":"D44+G44","v":0},null,"N/A",{"$f":"IF(I44*0.09<=H44,I44*0.09,H44)","v":0},0,null,null,null,null,0,0,0,0,0,0,0,0,0,0,0,0,0,0,0,0,0,null,0,0,0]
["Sheetflow to Conservation Area with C/D Soils",null,null,{"$f":"1/12*(0.95*B45+$B$13*C45)*43560","v":0},"Reduce volume conveyed to conservation area by 4 cu. ft per each 100 sq. ft. of conservation area.","N/A",{"$f":"AE49","v":0},{"$f":"D45+G45","v":0},null,"N/A",{"$f":"IF(I45*0.04<=H45,I45*0.04,H45)","v":0},0,null,null,null,null,0,0,0,0,{"$f":"IF($M45=U$17, $H45, 0)","v":0},0,0,0,0,0,0,0,0,0,0,0,0,null,0,0,0]
["Sheetflow to Vegetated Filter Strip in A/B Soils or Compost Amended C/D Soils",null,null,{"$f":"1/12*(0.95*B46+$B$13*C46)*43560","v":0},"Reduce volume conveyed to conservation area by 6 cu. ft per each 100 sq. ft. of filter strip.","N/A",{"$f":"AF49","v":0},{"$f":"D46+G46","v":0},null,"N/A",{"$f":"IF(I46*0.06<=H46,I46*0.06,H46)","v":0},0,null,null,null,null,0,0,0,0,0,0,0,0,0,0,0,0,0,0,0,0,0,null,0,0,0]
["Sheet flow to Vegetated Filter Strip in C/D Soils",null,null,{"$f":"1/12*(0.95*B47+$B$13*C47)*43560","v":0},"Reduce volume conveyed to conservation area by 3 cu. ft per each 100 sq. ft. of filter strip.","N/A",{"$f":"AG49","v":0},{"$f":"D47+G47","v":0},null,"N/A",{"$f":"IF(I47*0.03<=H47,I47*0.03,H47)","v":0},0,null,null,null,null,0,0,0,0,0,0,0,0,0,0,0,0,0,0,0,0,0,null,0,0,0]
["Totals",{"$f":"IF(SUM(B17:B47)>F10,\"Please Check the Contributing Areas: \" &SUM(B17:B47)-F10&\" acre Over\",SUM(B17:B47))","v":0},{"$f":"IF(SUM(C17:C47)>F9,\"Please Check the Contributing Areas: \" &SUM(C17:C47)-F9&\" acre Over\",SUM(C17:C47))","v":0},null,null,null,null,null,null,"Runoff Reduction Volume Achieved for Drainage Area A:",{"$f":"SUM(K17:K47)","v":0},"See Runoff Reduction Summary Tab for Detailed Results"]
[null,null,null,null,null,null,null,null,null,"Runoff Reduction Volume Balance for Total Site",{"$f":"ROUND('Site Data'!B88-'D.A. A'!K48-'D.A. B'!K48-'D.A. C'!K48-'D.A. D'!K48-'D.A. E'!K48,0)","v":0},{"$f":"IF(ROUND('Site Data'!B88-'D.A. A'!K48-'D.A. B'!K48-'D.A. C'!K48-'D.A. D'!K48-'D.A. E'!K48,0)<0,\"More Credit than needed has been provided\",\"\")","v":""},null,null,null,"Totals",{"$f":"SUM(Q17:Q48)","v":0},0,0,0,0,0,0,0,0,0,0,0,0,0,0,0,0,null,{"$f":"SUM(AI17:AI48)","v":0},0,0]
[]
[]
[]
[]
["Downstream Options"]
[{"$f":"A21","v":"Simple Disconnection to A/B Soils or Soil-Amended Filter Path in C/D Soils (4.2.2, Appendix D)"}]
[{"$f":"A22","v":"Simple Disconnection to C/D Soils (4.2.2)"}]
["To Residential Rain Garden (4.2.3.C)"]
[{"$f":"A24","v":"To Rainwater Harvesting (4.2.8)"}]
[{"$f":"A30","v":"Grass Swale A/B Soils"}]
[{"$f":"A31","v":"Grass Swale C/D Soils"}]
[{"$f":"A32","v":"Grass Swale in C/D Soil with Soil Amendments"}]
[{"$f":"A34","v":"Water Quality Swale, Level 1"}]
[{"$f":"A35","v":"Water Quality Swale, Level 2"}]
[{"$f":"A37","v":"Bioretention, Level 1 or Urban Bioretention (4.2.3.B)"}]
[{"$f":"A38","v":"Bioretention, Level 2"}]
[{"$f":"A40","v":"Infiltration"}]
[{"$f":"A42","v":"*Filtration Practice/Stormwater Wetland do NOT receive runoff reduction values, but do have associated pollutant removal values"}]
[{"$f":"A44","v":"Sheetflow to Conservation Area with A/B Soils"}]
[{"$f":"A45","v":"Sheetflow to Conservation Area with C/D Soils"}]
[{"$f":"A46","v":"Sheetflow to Vegetated Filter Strip in A/B Soils or Compost Amended C/D Soils"}]
[{"$f":"A47","v":"Sheet flow to Vegetated Filter Strip in C/D Soils"}]

{"sheet":"D.A. E","index":5,"n_rows":71,"n_cols":37,"rows_kept":71,"cut":false,"hidden":false,"merged":[[0,0,0,4]]}
["West Virginia MS4 Stormwater Compliance Spreadsheet v2.0; April 2013"]
[]
["Drainage Area E"]
[]
[]
["Drainage Area E Post-Development Land Cover (acres)"]
["Land Cover Type","HSG A soils","HSG B Soils","HSG C Soils","HSG D Soils","Totals"]
["Forest/Preserved Open Space",{"$f":"'Site Data'!B45","v":0},{"$f":"'Site Data'!C45","v":0},{"$f":"'Site Data'!D45","v":0},{"$f":"'Site Data'!E45","v":0},{"$f":"SUM(B8:E8)","v":0},null,{"$f":"\"RRv Achieved for Drainage Area \"&RIGHT(A3,1)&\" (cubic feet)\"","v":"RRv Achieved for Drainage Area E (cubic feet)"},null,null,{"$f":"K48","v":0}]
["Managed Turf",{"$f":"'Site Data'!B46","v":0},{"$f":"'Site Data'!C46","v":0},{"$f":"'Site Data'!D46","v":0},{"$f":"'Site Data'!E46","v":0},{"$f":"SUM(B9:E9)","v":0},null,{"$f":"\"RRv Balance for Drainage Area \"&RIGHT(A3,1)&\" (cubic feet)\"","v":"RRv Balance for Drainage Area E (cubic feet)"},null,null,{"$f":"'Site Data'!B86/12*B12*F11*43560-K8","v":0},{"$f":"IFERROR(L49,\"\")","v":""}]
["Impervious Cover ",{"$f":"'Site Data'!B47","v":0},{"$f":"'Site Data'!C47","v":0},{"$f":"'Site Data'!D47","v":0},{"$f":"'Site Data'!E47","v":0},{"$f":"SUM(B10:E10)","v":0},null,"RRv Balance for Total Site (cubic feet)",null,null,{"$f":"K49","v":0}]
[null,null,null,null,"Total",{"$f":"SUM(F8:F10)","v":0}]
["Rv(drainage area)",{"$f":"IFERROR(B13*F9/F11+B14*F10/F11,0)","v":0}]
["Rv(turf)",{"$f":"IF(F9>0,SUMPRODUCT(B9:E9,'Site Data'!B61:E61)/F9,0)","v":0}]
["Rv(impervious)",0.95]
[]
["Apply Runoff Reduction Practices"]
["Runoff Reduction Practice","Impervious Cover in Contributing Drainage Area (acres)","Managed Turf in Contributing Drainage Area (acres)","Volume Received by Practice      (cubic feet)","Description of Credit","% Credit","Volume Received from Upstream Practices     (cubic feet)","Total Volume Received by Practice       (cubic feet)","Disconnection Area of Practice (square feet)","Storage Volume Provided by Practice    (cubic feet)","Runoff Reduction (cubic feet)","Remaining Volume    (cubic feet)","Downstream Practice",null,null,null,{"$f":"A21","v":"Simple Disconnection to A/B Soils or Soil-Amended Filter Path in C/D Soils (4.2.2, Appendix D)"},{"$f":"A22","v":"Simple Disconnection to C/D Soils (4.2.2)"},{"$f":"A23","v":"To Residential Rain Garden (4.2.3.C)"},{"$f":"A24","v":"To Rainwater Harvesting (4.2.8)"},{"$f":"A30","v":"Grass Swale A/B Soils"},{"$f":"A31","v":"Grass Swale C/D Soils"},{"$f":"A32","v":"Grass Swale in C/D Soil with Soil Amendments"},{"$f":"A34","v":"Water Quality Swale, Level 1"},{"$f":"A35","v":"Water Quality Swale, Level 2"},{"$f":"A37","v":"Bioretention, Level 1 or Urban Bioretention (4.2.3.B)"},{"$f":"A38","v":"Bioretention, Level 2"},{"$f":"A40","v":"Infiltration"},{"$f":"A42","v":"*Filtration Practice/Stormwater Wetland do NOT receive runoff reduction values, but do have associated pollutant removal values"},{"$f":"A44","v":"Sheetflow to Conservation Area with A/B Soils"},{"$f":"A45","v":"Sheetflow to Conservation Area with C/D Soils"},{"$f":"A46","v":"Sheetflow to Vegetated Filter Strip in A/B Soils or Compost Amended C/D Soils"},{"$f":"A47","v":"Sheet flow to Vegetated Filter Strip in C/D Soils"},null,{"$f":"A30","v":"Grass Swale A/B Soils"},{"$f":"A31","v":"Grass Swale C/D Soils"},{"$f":"A32","v":"Grass Swale in C/D Soil with Soil Amendments"}]
["1. Vegetated Roof (4.2.9)"]
["Vegetated Roof",null,"N/A",{"$f":"1/12*0.95*B19*43560","v":0},"Reduce volume conveyed through green roof by 100%.",1,"N/A",{"$f":"D19","v":0},"N/A",null,{"$f":"IF(J19*F19<=H19,J19*F19,H19)","v":0},{"$f":"H19-K19","v":0},null,null,null,null,{"$f":"IF($M19=Q$17, $L19, 0)","v":0},{"$f":"IF($M19=R$17, $L19, 0)","v":0},0,0,{"$f":"IF($M19=U$17, $H19, 0)","v":0},{"$f":"IF($M19=V$17, $H19, 0)","v":0},{"$f":"IF($M19=W$17, $H19, 0)","v":0},0,0,0,0,0,0,0,0,{"$f":"IF($M19=AF$17, $L19, 0)","v":0},{"$f":"IF($M19=AG$17, $L19, 0)","v":0},null,{"$f":"IF($M19=AI$17, $H19, 0)","v":0},{"$f":"IF($M19=AJ$17, $H19, 0)","v":0},{"$f":"IF($M19=AK$17, $H19, 0)","v":0}]
["2. Impervious Surface Disconnection/Rooftop Practices ",null,null,null,null,null,null,null,null,null,null,null,null,null,null,null,null,null,null,null,null,null,null,null,null,null,null,null,null,null,null,null,{"$f":"IF($M20=AG$17, $L20, 0)","v":0}]
["Simple Disconnection to A/B Soils or Soil-Amended Filter Path in C/D Soils (4.2.2, Appendix D)",null,"N/A",{"$f":"1/12*0.95*B21*43560","v":0},"Reduce volume conveyed to conservation area by 4 cu. ft per each 100 sq. ft. of pervious receiving area.","N/A",{"$f":"Q49","v":0},{"$f":"D21+G21","v":0},null,"N/A",{"$f":"IF(I21*0.04<=H21,I21*0.04,H21)","v":0},0,null,null,null,null,{"$f":"IF($M21=Q$17, $L21, 0)","v":0},0,0,0,{"$f":"IF($M21=U$17, $H21, 0)","v":0},0,0,0,0,0,0,0,0,0,0,{"$f":"IF($M21=AF$17, $L21, 0)","v":0},0,null,{"$f":"IF($M21=AI$17, $H21, 0)","v":0},0,0]
["Simple Disconnection to C/D Soils (4.2.2)",null,"N/A",{"$f":"1/12*0.95*B22*43560","v":0},"Reduce volume conveyed to conservation area by 2 cu. ft per each 100 sq. ft. of pervious receiving area.","N/A",{"$f":"R49","v":0},{"$f":"D22+G22","v":0},null,"N/A",{"$f":"IF(I22*0.02<=H22,I22*0.02,H22)","v":0},0,null,null,null,null,{"$f":"IF($M22=Q$17, $L22, 0)","v":0},0,0,0,0,0,0,0,0,0,0,0,0,0,0,{"$f":"IF($M22=AF$17, $L22, 0)","v":0},0,null,0,0,0]
["To Residential Rain Garden (4.2.3.C)",null,"N/A",{"$f":"1/12*0.95*B23*43560","v":0},"60% volume reduction for the Design Volume of the practice",0.6,{"$f":"S49","v":0},{"$f":"D23+G23","v":0},"N/A",null,{"$f":"IF(J23*F23<=H23,J23*F23,H23)","v":0},0,null,null,null,null,{"$f":"IF($M23=Q$17, $L23, 0)","v":0},0,0,0,0,0,0,0,0,0,0,0,0,0,0,{"$f":"IF($M23=AF$17, $L23, 0)","v":0},0,null,0,0,0]
["To Rainwater Harvesting (4.2.8)",null,"N/A",{"$f":"1/12*0.95*B24*43560","v":0},"Subtract a variable % of the provided Design Volume based on annual  beneficial use (see Cistern Design Spreadsheet).",null,{"$f":"T49","v":0},{"$f":"D24+G24","v":0},"N/A",null,{"$f":"IF(J24*F24<=H24,J24*F24,H24)","v":0},0,null,null,null,null,{"$f":"IF($M24=Q$17, $L24, 0)","v":0},0,0,0,0,0,0,0,0,0,0,0,0,0,0,{"$f":"IF($M24=AF$17, $L24, 0)","v":0},0,null,0,0,0]
["3. Permeable Pavement (4.2.4)",null,null,null,null,null,null,null,null,null,null,null,null,"Storage Volume Provided by Sump Below Underdrain (cubic feet)","Storage Volume Provided by Reservoir Layer Above Underdrain (cubic feet)"]
["Permeable Pavement, Level 1",null,"N/A",{"$f":"1/12*0.95*B26*43560","v":0},"Subtract 45% of the provided storage volume.",0.45,"N/A",{"$f":"D26","v":0},"N/A",null,{"$f":"IF(J26*F26<=H26,J26*F26,H26)","v":0},0,null,null,null,null,{"$f":"IF($M26=Q$17, $L26, 0)","v":0},0,0,0,{"$f":"IF($M26=U$17, $H26, 0)","v":0},0,0,0,0,0,0,0,0,0,0,{"$f":"IF($M26=AF$17, $L26, 0)","v":0},0,null,{"$f":"IF($M26=AI$17, $H26, 0)","v":0},0,0]
["Permeable Pavement, Level 2 (infiltration)",null,"N/A",{"$f":"1/12*0.95*B27*43560","v":0},"Subtract 100% of the provided storage volume.",1,"N/A",{"$f":"D27","v":0},"N/A",null,{"$f":"IF(J27*F27<=H27,J27*F27,H27)","v":0},0,null,null,null,null,{"$f":"IF($M27=Q$17, $L27, 0)","v":0},0,0,0,0,0,0,0,0,0,0,0,0,0,0,{"$f":"IF($M27=AF$17, $L27, 0)","v":0},0,null,0,0,0]
["Permeable Pavement, Level 2 (infiltration & underdrain)",null,"N/A",{"$f":"1/12*0.95*B28*43560","v":0},"Subtract 100% of the provided storage volume of sump and 45% of the provided storage volume in reservoir layer.",null,"N/A",{"$f":"D28","v":0},"N/A",null,{"$f":"IF(N28*F27+O28*F26<=H28,N28*F27+O28*F26,H28)","v":0},0,null,null,null,null,{"$f":"IF($M28=Q$17, $L28, 0)","v":0},0,0,0,{"$f":"IF($M28=U$17, $H28, 0)","v":0},{"$f":"IF($M28=V$17, $H28, 0)","v":0},{"$f":"IF($M28=W$17, $H28, 0)","v":0},0,0,0,0,0,0,0,0,{"$f":"IF($M28=AF$17, $L28, 0)","v":0},0,null,{"$f":"IF($M28=AI$17, $H28, 0)","v":0},{"$f":"IF($M28=AJ$17, $H28, 0)","v":0},{"$f":"IF($M28=AK$17, $H28, 0)","v":0}]
["4. Grass Swale (4.2.5)",null,null,null,null,null,null,null,null,null,null,null,null,"Water volume associated with contributing area (cubic feet)",null,null,null,null,null,null,null,null,null,null,null,null,null,null,null,null,null,null,0]
["Grass Swale A/B Soils",null,null,{"$f":"1/12*(0.95*B30+$B$13*C30)*43560","v":0},"Reduce volume conveyed through grass swale by 0.2 inches.",0.2,{"$f":"U49","v":0},{"$f":"D30+G30","v":0},"N/A","N/A",{"$f":"IF((H30+(N30-G30))*F30>H30,H30,(H30+(N30-G30))*F30)","v":0},{"$f":"(D30-D30*F30)+IF((G30-N30*F30)<0,0,(G30-N30*F30))","v":0},null,{"$f":"AI49","v":0},null,null,{"$f":"IF($M30=Q$17, $L30, 0)","v":0},0,0,0,{"$f":"IF($M30=U$17, $H30, 0)","v":0},0,0,0,0,0,0,0,0,0,0,{"$f":"IF($M30=AF$17, $L30, 0)","v":0},0,null,{"$f":"IF($M30=AI$17, $H30, 0)","v":0},0,0]
["Grass Swale C/D Soils",null,null,{"$f":"1/12*(0.95*B31+$B$13*C31)*43560","v":0},"Reduce volume conveyed through grass swale by 0.1 inches.",0.1,{"$f":"V49","v":0},{"$f":"D31+G31","v":0},"N/A","N/A",{"$f":"IF((H31+(N31-G31))*F31>H31,H31,(H31+(N31-G31))*F31)","v":0},{"$f":"(D31-D31*F31)+IF((G31-N31*F31)<0,0,(G31-N31*F31))","v":0},null,{"$f":"AJ49","v":0},null,null,{"$f":"IF($M31=Q$17, $L31, 0)","v":0},0,0,0,0,0,0,0,0,0,0,0,0,0,0,{"$f":"IF($M31=AF$17, $L31, 0)","v":0},0,null,0,0,0]
["Grass Swale in C/D Soil with Soil Amendments",null,null,{"$f":"1/12*(0.95*B32+$B$13*C32)*43560","v":0},"Reduce volume conveyed through grass swale by 0.2 inches.",0.2,{"$f":"W49","v":0},{"$f":"D32+G32","v":0},"N/A","N/A",0,0,null,{"$f":"AK49","v":0},null,null,{"$f":"IF($M32=Q$17, $L32, 0)","v":0},0,0,0,0,0,0,0,0,0,0,0,0,0,0,{"$f":"IF($M32=AF$17, $L32, 0)","v":0},0,null,0,0,0]
["5. Water Quality Swale (4.2.3.A)",null,null,null,null,null,null,null,null,null,null,null,null,null,null,null,null,null,null,null,null,null,null,null,null,null,null,null,null,null,null,null,0]
["Water Quality Swale, Level 1",null,null,{"$f":"1/12*(0.95*B34+$B$13*C34)*43560","v":0},"Subtract 55% of the provided storage volume.",0.55000000000000004,{"$f":"X49","v":0},{"$f":"D34+G34","v":0},"N/A",null,{"$f":"IF(J34*F34<=H34,J34*F34,H34)","v":0},0,null,null,null,null,{"$f":"IF($M34=Q$17, $L34, 0)","v":0},0,0,0,{"$f":"IF($M34=U$17, $H34, 0)","v":0},0,0,0,0,0,0,0,0,0,0,{"$f":"IF($M34=AF$17, $L34, 0)","v":0},0,null,{"$f":"IF($M34=AI$17, $H34, 0)","v":0},0,0]
["Water Quality Swale, Level 2",null,null,{"$f":"1/12*(0.95*B35+$B$13*C35)*43560","v":0},"Subtract 100% of the provided storage volume.",1,{"$f":"Y49","v":0},{"$f":"D35+G35","v":0},"N/A",null,{"$f":"IF(J35*F35<=H35,J35*F35,H35)","v":0},0,null,null,null,null,{"$f":"IF($M35=Q$17, $L35, 0)","v":0},0,0,0,0,0,0,0,0,0,0,0,0,0,0,{"$f":"IF($M35=AF$17, $L35, 0)","v":0},0,null,0,0,0]
["6. Bioretention (4.2.3)",null,null,null,null,null,null,null,null,null,null,null,null,null,null,null,null,null,null,null,null,null,null,null,null,null,null,null,null,null,null,null,0]
["Bioretention, Level 1 or Urban Bioretention (4.2.3.B)",null,null,{"$f":"1/12*(0.95*B37+$B$13*C37)*43560","v":0},"Subtract 60% of the provided storage volume.",0.6,{"$f":"Z49","v":0},{"$f":"D37+G37","v":0},"N/A",null,{"$f":"IF(J37*F37<=H37,J37*F37,H37)","v":0},0,null,null,null,null,{"$f":"IF($M37=Q$17, $L37, 0)","v":0},0,0,0,{"$f":"IF($M37=U$17, $H37, 0)","v":0},0,0,0,0,0,0,0,0,0,0,{"$f":"IF($M37=AF$17, $L37, 0)","v":0},0,null,{"$f":"IF($M37=AI$17, $H37, 0)","v":0},0,0]
["Bioretention, Level 2",null,null,{"$f":"1/12*(0.95*B38+$B$13*C38)*43560","v":0},"Subtract 100% of the provided storage volume.",1,{"$f":"AA49","v":0},{"$f":"D38+G38","v":0},"N/A",null,{"$f":"IF(J38*F38<=H38,J38*F38,H38)","v":0},0,null,null,null,null,0,0,0,0,0,0,0,0,0,0,0,0,0,0,{"$f":"IF($M38=AE$17, $L38, 0)","v":0},{"$f":"IF($M38=AF$17, $L38, 0)","v":0},0,null,0,0,0]
["7. Infiltration (4.2.6) or Regenerative Stormwater Conveyance (4.2.7)",null,null,null,null,null,null,null,null,null,null,null,null,null,null,null,null,null,null,null,null,null,null,null,null,null,null,null,null,null,null,null,0]
["Infiltration",null,null,{"$f":"1/12*(0.95*B40+$B$13*C40)*43560","v":0},"Subtract 100% of the provided storage volume.",1,{"$f":"AB49","v":0},{"$f":"D40+G40","v":0},"N/A",null,{"$f":"IF(J40*F40<=H40,J40*F40,H40)","v":0},0,null,null,null,null,{"$f":"IF($M40=Q$17, $L40, 0)","v":0},{"$f":"IF($M40=R$17, $L40, 0)","v":0},0,0,{"$f":"IF($M40=U$17, $H40, 0)","v":0},{"$f":"IF($M40=V$17, $H40, 0)","v":0},{"$f":"IF($M40=W$17, $H40, 0)","v":0},0,0,0,0,0,0,0,0,{"$f":"IF($M40=AF$17, $L40, 0)","v":0},0,null,{"$f":"IF($M40=AI$17, $H40, 0)","v":0},{"$f":"IF($M40=AJ$17, $H40, 0)","v":0},{"$f":"IF($M40=AK$17, $H40, 0)","v":0}]
["8. Filtration Practice (4.2.10) or Stormwater Wetland (4.2.11)*",null,null,null,null,null,null,null,null,null,null,null,null,null,null,null,null,null,null,null,null,null,null,null,null,null,null,null,null,null,null,null,0]
["*Filtration Practice/Stormwater Wetland do NOT receive runoff reduction values, but do have associated pollutant removal values",null,null,{"$f":"1/12*(0.95*B42+$B$13*C42)*43560","v":0},"0% runoff reduction",0,{"$f":"AC49","v":0},{"$f":"D42+G42","v":0},"N/A",{"$f":"0.1*H42","v":0},{"$f":"IF(J42*F42<=H42,J42*F42,H42)","v":0},0,null,null,null,null,{"$f":"IF($M42=Q$17, $L42, 0)","v":0},{"$f":"IF($M42=R$17, $L42, 0)","v":0},0,0,{"$f":"IF($M42=U$17, $H42, 0)","v":0},0,0,0,0,0,0,0,0,0,0,{"$f":"IF($M42=AF$17, $L42, 0)","v":0},0,null,{"$f":"IF($M42=AI$17, $H42, 0)","v":0},0,0]
["9. Sheetflow to Filter/Conservation Area (4.2.1)",null,null,null,null,null,null,null,null,null,null,null,null,null,null,null,{"$f":"IF($M43=Q$17, $L43, 0)","v":0},0,0,0,null,null,null,0,0,0,0,0,0,0,0,0,0]
["Sheetflow to Conservation Area with A/B Soils",null,null,{"$f":"1/12*(0.95*B44+$B$13*C44)*43560","v":0},"Reduce volume conveyed to conservation area by 9 cu. ft per each 100 sq. ft. of conservation area.","N/A",{"$f":"AD49","v":0},{"$f":"D44+G44","v":0},null,"N/A",{"$f":"IF(I44*0.09<=H44,I44*0.09,H44)","v":0},0,null,null,null,null,0,0,0,0,0,0,0,0,0,0,0,0,0,0,0,0,0,null,0,0,0]
["Sheetflow to Conservation Area with C/D Soils",null,null,{"$f":"1/12*(0.95*B45+$B$13*C45)*43560","v":0},"Reduce volume conveyed to conservation area by 4 cu. ft per each 100 sq. ft. of conservation area.","N/A",{"$f":"AE49","v":0},{"$f":"D45+G45","v":0},null,"N/A",{"$f":"IF(I45*0.04<=H45,I45*0.04,H45)","v":0},0,null,null,null,null,0,0,0,0,{"$f":"IF($M45=U$17, $H45, 0)","v":0},0,0,0,0,0,0,0,0,0,0,0,0,null,0,0,0]
["Sheetflow to Vegetated Filter Strip in A/B Soils or Compost Amended C/D Soils",null,null,{"$f":"1/12*(0.95*B46+$B$13*C46)*43560","v":0},"Reduce volume conveyed to conservation area by 6 cu. ft per each 100 sq. ft. of filter strip.","N/A",{"$f":"AF49","v":0},{"$f":"D46+G46","v":0},null,"N/A",{"$f":"IF(I46*0.06<=H46,I46*0.06,H46)","v":0},0,null,null,null,null,0,0,0,0,0,0,0,0,0,0,0,0,0,0,0,0,0,null,0,0,0]
["Sheet flow to Vegetated Filter Strip in C/D Soils",null,null,{"$f":"1/12*(0.95*B47+$B$13*C47)*43560","v":0},"Reduce volume conveyed to conservation area by 3 cu. ft per each 100 sq. ft. of filter strip.","N/A",{"$f":"AG49","v":0},{"$f":"D47+G47","v":0},null,"N/A",{"$f":"IF(I47*0.03<=H47,I47*0.03,H47)","v":0},0,null,null,null,null,0,0,0,0,0,0,0,0,0,0,0,0,0,0,0,0,0,null,0,0,0]
["Totals",{"$f":"IF(SUM(B17:B47)>F10,\"Please Check the Contributing Areas: \" &SUM(B17:B47)-F10&\" acre Over\",SUM(B17:B47))","v":0},{"$f":"IF(SUM(C17:C47)>F9,\"Please Check the Contributing Areas: \" &SUM(C17:C47)-F9&\" acre Over\",SUM(C17:C47))","v":0},null,null,null,null,null,null,"Runoff Reduction Volume Achieved for Drainage Area A:",{"$f":"SUM(K17:K47)","v":0},"See Runoff Reduction Summary Tab for Detailed Results"]
[null,null,null,null,null,null,null,null,null,"Runoff Reduction Volume Balance for Total Site",{"$f":"ROUND('Site Data'!B88-'D.A. A'!K48-'D.A. B'!K48-'D.A. C'!K48-'D.A. D'!K48-'D.A. E'!K48,0)","v":0},{"$f":"IF(ROUND('Site Data'!B88-'D.A. A'!K48-'D.A. B'!K48-'D.A. C'!K48-'D.A. D'!K48-'D.A. E'!K48,0)<0,\"More Credit than needed has been provided\",\"\")","v":""},null,null,null,"Totals",{"$f":"SUM(Q17:Q48)","v":0},0,0,0,0,0,0,0,0,0,0,0,0,0,0,0,0,null,{"$f":"SUM(AI17:AI48)","v":0},0,0]
[]
[]
[]
[]
["Downstream Options"]
[{"$f":"A21","v":"Simple Disconnection to A/B Soils or Soil-Amended Filter Path in C/D Soils (4.2.2, Appendix D)"}]
[{"$f":"A22","v":"Simple Disconnection to C/D Soils (4.2.2)"}]
["To Residential Rain Garden (4.2.3.C)"]
[{"$f":"A24","v":"To Rainwater Harvesting (4.2.8)"}]
[{"$f":"A30","v":"Grass Swale A/B Soils"}]
[{"$f":"A31","v":"Grass Swale C/D Soils"}]
[{"$f":"A32","v":"Grass Swale in C/D Soil with Soil Amendments"}]
[{"$f":"A34","v":"Water Quality Swale, Level 1"}]
[{"$f":"A35","v":"Water Quality Swale, Level 2"}]
[{"$f":"A37","v":"Bioretention, Level 1 or Urban Bioretention (4.2.3.B)"}]
[{"$f":"A38","v":"Bioretention, Level 2"}]
[{"$f":"A40","v":"Infiltration"}]
[{"$f":"A42","v":"*Filtration Practice/Stormwater Wetland do NOT receive runoff reduction values, but do have associated pollutant removal values"}]
[{"$f":"A44","v":"Sheetflow to Conservation Area with A/B Soils"}]
[{"$f":"A45","v":"Sheetflow to Conservation Area with C/D Soils"}]
[{"$f":"A46","v":"Sheetflow to Vegetated Filter Strip in A/B Soils or Compost Amended C/D Soils"}]
[{"$f":"A47","v":"Sheet flow to Vegetated Filter Strip in C/D Soils"}]

{"sheet":"Runoff Reduction Summary","index":6,"n_rows":16,"n_cols":2,"rows_kept":16,"cut":false,"hidden":false,"merged":[[0,0,0,2]]}
["West Virginia MS4 Stormwater Compliance Spreadsheet v2.0; April 2013"]
[]
[]
["Stormwater Runoff Reduction Summary"]
[]
["Target Runoff Reduction Volume, RRv (cubic feet)",{"$f":"'Site Data'!B88","v":0}]
["Runoff Reduction Achieved (cubic feet)",{"$f":"'D.A. A'!K48+'D.A. B'!K48+'D.A. C'!K48+'D.A. D'!K48+'D.A. E'!K48","v":0}]
[]
["Runoff Reduction Volume Remaining (cubic feet)",{"$f":"IF(B6-B7>0,B6-B7,0)","v":0}]
[]
[]
[]
[]
["1.5:1 Mitigation Runoff Volume (cubic feet)",{"$f":"IF(B9<0.6*1/12*'Site Data'!B75*'Site Data'!B74*43560,B9*1.5,0.6*1/12*'Site Data'!B75*'Site Data'!B74*43560*1.5)","v":0}]
["2:1 Mitigation Runoff Volume (cubic feet)",{"$f":"IF(B9>0.6*1/12*'Site Data'!B75*'Site Data'!B74*43560,(B9-0.6*1/12*'Site Data'!B75*'Site Data'!B74*43560)*2,0)","v":0}]
["Total Mitigation Runoff Volume Required (cubic feet)",{"$f":"B15+B14","v":0}]

{"sheet":"Channel and Flood Protection","index":7,"n_rows":626,"n_cols":14,"rows_kept":626,"cut":false,"hidden":false,"merged":[[88,0,89,1],[90,0,91,1],[95,0,95,2],[96,0,96,2],[80,0,80,2],[81,0,81,2],[85,0,85,1],[86,0,87,1],[70,0,70,1],[71,0,72,1],[73,0,74,1],[75,0,76,1],[58,0,59,1],[60,0,61,1],[65,0,65,2],[66,0,66,2],[51,0,51,2],[55,0,55,1],[56,0,57,1],[40,0,40,1],[41,0,42,1],[43,0,44,1],[45,0,46,1],[12,0,12,1],[13,0,13,1],[15,0,15,2],[16,0,16,1],[50,0,50,2],[25,0,25,1],[17,0,17,1],[19,0,19,2],[20,0,20,1],[21,0,21,1],[36,0,36,2],[26,0,27,1],[28,0,29,1],[35,0,35,2],[30,0,31,1],[8,0,8,1],[9,0,9,1],[11,0,11,2],[1,0,1,1],[4,0,4,1],[3,0,3,2],[5,0,5,1],[6,0,6,1],[7,0,7,2]]}
["WV MS4 Stormwater Compliance Spreadsheet v2.0; April 2013 ",null,null,"1-year storm","2-year storm","10-year storm"]
["Target Rainfall Event (in)",null,null,2.7,3.35,5.15]
[]
["Drainage Area A"]
["Drainage Area (acres)",null,{"$f":"'D.A. A'!$F$11","v":0}]
["Storage Volume Provided By Runoff Reduction Practices (cf)",null,{"$f":"'D.A. A'!$J$19+'D.A. A'!$K$21+'D.A. A'!$K$22+'D.A. A'!$J$23+'D.A. A'!$J$24+'D.A. A'!$J$26+'D.A. A'!$J$27+'D.A. A'!$N$28+'D.A. A'!$O$28+'D.A. A'!$K$30+'D.A. A'!$K$31+'D.A. A'!$K$32+'D.A. A'!$J$34+'D.A. A'!$J$35+'D.A. A'!$J$37+'D.A. A'!$J$38+'D.A. A'!$J$40+'D.A. A'!$K$42+'D.A. A'!$K$44+'D.A. A'!$K$45+'D.A. A'!$K$46+'D.A. A'!$K$47","v":0}]
[]
["Drainage Area B"]
["Drainage Area (acres)",null,{"$f":"'D.A. B'!$F$11","v":0}]
["Storage Volume Provided By Runoff Reduction Practices (cf)",null,{"$f":"'D.A. B'!$J$19+'D.A. B'!$K$21+'D.A. B'!$K$22+'D.A. B'!$J$23+'D.A. B'!$J$24+'D.A. B'!$J$26+'D.A. B'!$J$27+'D.A. B'!$N$28+'D.A. B'!$O$28+'D.A. B'!$K$30+'D.A. B'!$K$31+'D.A. B'!$K$32+'D.A. B'!$J$34+'D.A. B'!$J$35+'D.A. B'!$J$37+'D.A. B'!$J$38+'D.A. B'!$J$40+'D.A. B'!$K$42+'D.A. B'!$K$44+'D.A. B'!$K$45+'D.A. B'!$K$46+'D.A. B'!$K$47","v":0}]
[]
["Drainage Area C"]
["Drainage Area (acres)",null,{"$f":"'D.A. C'!$F$11","v":0}]
["Storage Volume Provided By Runoff Reduction Practices (cf)",null,{"$f":"'D.A. C'!$J$19+'D.A. C'!$K$21+'D.A. C'!$K$22+'D.A. C'!$J$23+'D.A. C'!$J$24+'D.A. C'!$J$26+'D.A. C'!$J$27+'D.A. C'!$N$28+'D.A. C'!$O$28+'D.A. C'!$K$30+'D.A. C'!$K$31+'D.A. C'!$K$32+'D.A. C'!$J$34+'D.A. C'!$J$35+'D.A. C'!$J$37+'D.A. C'!$J$38+'D.A. C'!$J$40+'D.A. C'!$K$42+'D.A. C'!$K$44+'D.A. C'!$K$45+'D.A. C'!$K$46+'D.A. C'!$K$47","v":0}]
[]
["Drainage Area D"]
["Drainage Area (acres)",null,{"$f":"'D.A. D'!$F$11","v":0}]
["Storage Volume Provided By Runoff Reduction Practices (cf)",null,{"$f":"'D.A. D'!$J$19+'D.A. D'!$K$21+'D.A. D'!$K$22+'D.A. D'!$J$23+'D.A. D'!$J$24+'D.A. D'!$J$26+'D.A. D'!$J$27+'D.A. D'!$N$28+'D.A. D'!$O$28+'D.A. D'!$K$30+'D.A. D'!$K$31+'D.A. D'!$K$32+'D.A. D'!$J$34+'D.A. D'!$J$35+'D.A. D'!$J$37+'D.A. D'!$J$38+'D.A. D'!$J$40+'D.A. D'!$K$42+'D.A. D'!$K$44+'D.A. D'!$K$45+'D.A. D'!$K$46+'D.A. D'!$K$47","v":0}]
[]
["Drainage Area E"]
["Drainage Area (acres)",null,{"$f":"'D.A. E'!$F$11","v":0}]
["Storage Volume Provided By Runoff Reduction Practices (cf)",null,{"$f":"'D.A. E'!$J$19+'D.A. E'!$K$21+'D.A. E'!$K$22+'D.A. E'!$J$23+'D.A. E'!$J$24+'D.A. E'!$J$26+'D.A. E'!$J$27+'D.A. E'!$N$28+'D.A. E'!$O$28+'D.A. E'!$K$30+'D.A. E'!$K$31+'D.A. E'!$K$32+'D.A. E'!$J$34+'D.A. E'!$J$35+'D.A. E'!$J$37+'D.A. E'!$J$38+'D.A. E'!$J$40+'D.A. E'!$K$42+'D.A. E'!$K$44+'D.A. E'!$K$45+'D.A. E'!$K$46+'D.A. E'!$K$47","v":0}]
[null,null,null,null,null,null,null,null,null,{"$f":"D1","v":"1-year storm"},{"$f":"E1","v":"2-year storm"},{"$f":"F1","v":"10-year storm"}]
["Based on the use of Runoff Reduction practices in the various drainage areas, the spreadsheet calculates an adjusted RVDeveloped and adjusted Curve Number.",null,null,null,null,null,null,null,null,"v",null,null,"CN","S"]
[]
["Drainage Area A",null,null,"A soils","B Soils","C Soils","D Soils",null,null,{"$f":"IF(D$2>0.2*($N26),(D$2-0.2*($N26))^2/(D$2+0.8*($N26)),0)","v":0},{"$f":"IF(E$2>0.2*($N26),(E$2-0.2*($N26))^2/(E$2+0.8*($N26)),0)","v":7.9804560260586365E-3},{"$f":"IF(F$2>0.2*($N26),(F$2-0.2*($N26))^2/(F$2+0.8*($N26)),0)","v":0.26953352769679312},40,{"$f":"IF(M26>0,1000/M26-10,1000)","v":15}]
["Forest/Preserved Open Space ",null,"Area (acres)",{"$f":"'D.A. A'!$B$8","v":0},{"$f":"'D.A. A'!$C$8","v":0},{"$f":"'D.A. A'!$D$8","v":0},{"$f":"'D.A. A'!$E$8","v":0},null,null,0,8.5870967654088151E-3,0.27346417157852049,{"$f":"M26+0.1","v":40.1},14.937655860349125]
[null,null,"CN",30,55,70,77,null,null,0,9.2148949090488253E-3,0.27741618490858394,40.200000000000003,14.875621890547261]
["Managed Turf ",null,"Area (acres)",{"$f":"'D.A. A'!$B$9","v":0},{"$f":"'D.A. A'!$C$9","v":0},{"$f":"'D.A. A'!$D$9","v":0},{"$f":"'D.A. A'!$E$9","v":0},null,null,0,9.8637478726237883E-3,0.28138945955310013,40.300000000000004,14.813895781637715]
[null,null,"CN",39,61,74,80,null,null,0,1.0533554253912697E-2,0.28538388853340868,40.400000000000006,14.75247524752475]
["Impervious Cover ",null,"Area (acres)",{"$f":"'D.A. A'!$B$10","v":0},{"$f":"'D.A. A'!$C$10","v":0},{"$f":"'D.A. A'!$D$10","v":0},{"$f":"'D.A. A'!$E$10","v":0},null,null,0,1.1224213818865165E-2,0.2893993660119849,40.500000000000007,14.691358024691354]
[null,null,"CN",98,98,98,98,null,null,0,1.1935627487847581E-2,0.29343578727856245,40.600000000000009,14.630541871921178]
[null,null,null,null,null,null,"Weighted CN","S",null,0,1.2667697322094894E-2,0.29749304873646121,40.70000000000001,14.570024570024565]
[null,null,null,null,null,null,{"$f":"IF(C5>0,(SUMPRODUCT(D27:G27,D28:G28)+SUMPRODUCT(D29:G29,D30:G30)+SUMPRODUCT(D31:G31,D32:G32))/C5,0)","v":0},{"$f":"IF(G34>0,1000/G34-10,1000)","v":1000},null,0,1.3420326510364324E-2,0.30157104788911454,40.800000000000011,14.509803921568622]
[null,null,null,{"$f":"D1","v":"1-year storm"},{"$f":"E1","v":"2-year storm"},{"$f":"F1","v":"10-year storm"},null,null,null,0,1.419341935578813E-2,0.30566968332679817,40.900000000000013,14.44987775061124]
["RVDeveloped (in) with no Runoff Reduction",null,null,{"$f":"IF(D$2>0.2*($H34),(D$2-0.2*($H34))^2/(D$2+0.8*($H34)),0)","v":0},{"$f":"IF(E$2>0.2*($H34),(E$2-0.2*($H34))^2/(E$2+0.8*($H34)),0)","v":0},{"$f":"IF(F$2>0.2*($H34),(F$2-0.2*($H34))^2/(F$2+0.8*($H34)),0)","v":0},null,null,null,0,1.4986881262921178E-2,0.30978885471354944,41.000000000000014,14.390243902439018]
["RVDeveloped (in) with Runoff Reduction",null,null,{"$f":"IF($C5>0,D36-$C6/3630/$C5,D36)","v":0},{"$f":"IF($C5>0,E36-$C6/3630/$C5,E36)","v":0},{"$f":"IF($C5>0,F36-$C6/3630/$C5,F36)","v":0},null,null,null,0,1.5800618724981209E-2,0.31392846277428277,41.100000000000016,14.330900243308992]
[null,null,"Adjusted CN for D.A. A",{"$f":"IF(D37>0,VLOOKUP(D37,J$26:$N$626,4),0)","v":0},{"$f":"IF(E37>0,VLOOKUP(E37,K$26:$N$626,3),0)","v":0},{"$f":"IF(F37>0,VLOOKUP(F37,L$26:$N$626,2),0)","v":0},null,null,null,0,1.6634539311276862E-2,0.31808840928208776,41.200000000000017,14.271844660194166]
[null,null,null,null,null,null,null,null,null,0,1.7488551654822469E-2,0.32226859704571781,41.300000000000018,14.213075060532677]
[null,null,null,null,null,null,null,null,null,0,1.8362565440134215E-2,0.32646892989725596,41.40000000000002,14.154589371980666]
["Drainage Area B",null,null,"A soils","B Soils","C Soils","D Soils",null,null,0,1.9256491391206453E-2,0.33068931267996282,41.500000000000021,14.096385542168662]
["Forest/Preserved Open Space ",null,"Area (acres)",{"$f":"'D.A. B'!$B$8","v":0},{"$f":"'D.A. B'!$C$8","v":0},{"$f":"'D.A. B'!$D$8","v":0},{"$f":"'D.A. B'!$E$8","v":0},null,null,0,2.0170241259663775E-2,0.33492965123629698,41.600000000000023,14.038461538461526]
[null,null,"CN",30,55,70,77,null,null,0,2.1103727813087125E-2,0.33918985239611199,41.700000000000024,13.980815347721808]
["Managed Turf ",null,"Area (acres)",{"$f":"'D.A. B'!$B$9","v":0},{"$f":"'D.A. B'!$C$9","v":0},{"$f":"'D.A. B'!$D$9","v":0},{"$f":"'D.A. B'!$E$9","v":0},null,null,0,2.2056864823509995E-2,0.34346982396501985,41.800000000000026,13.923444976076539]
[null,null,"CN",39,61,74,80,null,null,0,2.3029567056082514E-2,0.34776947471292308,41.900000000000027,13.866348448687337]
["Impervious Cover ",null,"Area (acres)",{"$f":"'D.A. B'!$B$10","v":0},{"$f":"'D.A. B'!$C$10","v":0},{"$f":"'D.A. B'!$D$10","v":0},{"$f":"'D.A. B'!$E$10","v":0},null,null,0,2.4021750257900702E-2,0.35208871436271244,42.000000000000028,13.809523809523792]
[null,null,"CN",98,98,98,98,null,null,0,2.503333114699725E-2,0.35642745357912198,42.10000000000003,13.752969121140126]
[null,null,null,null,null,null,"Weighted CN","S",null,0,2.6064227401492706E-2,0.360785603957748,42.200000000000031,13.696682464454959]
[null,null,null,null,null,null,{"$f":"IF(C9>0,(SUMPRODUCT(D42:G42,D43:G43)+SUMPRODUCT(D44:G44,D45:G45)+SUMPRODUCT(D46:G46,D47:G47))/C9,0)","v":0},{"$f":"IF(G49>0,1000/G49-10,1000)","v":1000},null,0,2.7114357648902892E-2,0.3651630780142206,42.300000000000033,13.640661938534262]
[null,null,null,{"$f":"D16","v":0},{"$f":"E16","v":0},{"$f":"F16","v":0},null,null,null,0,2.8183641455601049E-2,0.36955978917353094,42.400000000000034,13.584905660377341]
["RVDeveloped (in) with no Runoff Reduction",null,null,{"$f":"IF(D$2>0.2*($H49),(D$2-0.2*($H49))^2/(D$2+0.8*($H49)),0)","v":0},{"$f":"IF(E$2>0.2*($H49),(E$2-0.2*($H49))^2/(E$2+0.8*($H49)),0)","v":0},{"$f":"IF(F$2>0.2*($H49),(F$2-0.2*($H49))^2/(F$2+0.8*($H49)),0)","v":0},null,null,null,0,2.9271999316431676E-2,0.37397565175950859,42.500000000000036,13.529411764705863]
["RVDeveloped (in) with Runoff Reduction",null,null,{"$f":"IF($C9>0,D51-$C10/3630/$C9,D51)","v":0},{"$f":"IF($C9>0,E51-$C10/3630/$C9,E51)","v":0},{"$f":"IF($C9>0,F51-$C10/3630/$C9,F51)","v":0},null,null,null,1.9785974621986414E-6,3.0379352644473431E-2,0.37841058098444708,42.600000000000037,13.474178403755847]
[null,null,"Adjusted CN for D.A. B",{"$f":"IF(D52>0,VLOOKUP(D52,J$26:$N$626,4),0)","v":0},{"$f":"IF(E52>0,VLOOKUP(E52,K$26:$N$626,3),0)","v":0},{"$f":"IF(F52>0,VLOOKUP(F52,L$26:$N$626,2),0)","v":0},null,null,null,1.9435379567338815E-5,3.1505623760949404E-2,0.38286449293887714,42.700000000000038,13.419203747072579]
[null,null,null,null,null,null,null,null,null,5.4852488548499801E-5,3.2650735885281876E-2,0.38733730458148374,42.80000000000004,13.364485981308391]
[null,null,null,null,null,null,null,null,null,1.0815430720083956E-4,3.3814613125288641E-2,0.39182893372916222,42.900000000000041,13.310023310023286]
["Drainage Area C",null,null,"A soils","B Soils","C Soils","D Soils",null,null,1.7926610651092839E-4,3.4997180467519651E-2,0.39633929904721549,43.000000000000043,13.255813953488349]
["Forest/Preserved Open Space ",null,"Area (acres)",{"$f":"'D.A. C'!$B$8","v":0},{"$f":"'D.A. C'!$C$8","v":0},{"$f":"'D.A. C'!$D$8","v":0},{"$f":"'D.A. C'!$E$8","v":0},null,null,2.6811403620763478E-4,3.6198363767731813E-2,0.40086832003968975,43.100000000000044,13.201856148491856]
[null,null,"CN",30,55,70,77,null,null,{"$f":"IF(D$2>0.2*($N58),(D$2-0.2*($N58))^2/(D$2+0.8*($N58)),0)","v":3.7462511544892859E-4},{"$f":"IF(E$2>0.2*($N58),(E$2-0.2*($N58))^2/(E$2+0.8*($N58)),0)","v":3.7418089741497962E-2},{"$f":"IF(F$2>0.2*($N58),(F$2-0.2*($N58))^2/(F$2+0.8*($N58)),0)","v":0.40541591703984065},43.200000000000045,{"$f":"IF(M58>0,1000/M58-10,1000)","v":13.148148148148124}]
["Managed Turf ",null,"Area (acres)",{"$f":"'D.A. C'!$B$9","v":0},{"$f":"'D.A. C'!$C$9","v":0},{"$f":"'D.A. C'!$D$9","v":0},{"$f":"'D.A. C'!$E$9","v":0},null,null,4.9872722364255144E-4,3.8656285954950034E-2,0.40998201120073563,{"$f":"M58+0.1","v":43.300000000000047},13.094688221708982]
[null,null,"CN",39,61,74,80,null,null,6.403490913983789E-4,3.9912880815653154E-2,0.41456652448598524,43.400000000000048,13.041474654377854]
["Impervious Cover ",null,"Area (acres)",{"$f":"'D.A. C'!$B$10","v":0},{"$f":"'D.A. C'!$C$10","v":0},{"$f":"'D.A. C'!$D$10","v":0},{"$f":"'D.A. C'!$E$10","v":0},null,null,7.9942029161036011E-4,4.118780356360844E-2,0.41916937966060291,43.50000000000005,12.98850574712641]
[null,null,"CN",98,98,98,98,null,null,9.7587123066602253E-4,4.2480984262382976E-2,0.42379050028199028,43.600000000000051,12.935779816513733]
[null,null,null,null,null,null,"Weighted CN","S",null,1.1696331397815451E-3,4.3792353790364884E-2,0.42842981069104857,43.700000000000053,12.88329519450798]
[null,null,null,null,null,null,{"$f":"IF(C13>0,(SUMPRODUCT(D57:G57,D58:G58)+SUMPRODUCT(D59:G59,D60:G60)+SUMPRODUCT(D61:G61,D62:G62))/C13,0)","v":0},{"$f":"IF(G64>0,1000/G64-10,1000)","v":1000},null,1.3806380664603249E-3,4.5121843832140809E-2,0.43308723600340926,43.800000000000054,12.831050228310474]
[null,null,null,{"$f":"D31","v":0},{"$f":"E31","v":0},{"$f":"F31","v":0},null,null,null,1.6088188660733024E-3,4.6469386869995258E-2,0.43776270210078905,43.900000000000055,12.779043280182204]
["RVDeveloped (in) with no Runoff Reduction",null,null,{"$f":"IF(D$2>0.2*($H64),(D$2-0.2*($H64))^2/(D$2+0.8*($H64)),0)","v":0},{"$f":"IF(E$2>0.2*($H64),(E$2-0.2*($H64))^2/(E$2+0.8*($H64)),0)","v":0},{"$f":"IF(F$2>0.2*($H64),(F$2-0.2*($H64))^2/(F$2+0.8*($H64)),0)","v":0},null,null,null,1.8541091935588821E-3,4.7834916175528319E-2,0.44245613562245917,44.000000000000057,12.727272727272698]
["RVDeveloped (in) with Runoff Reduction",null,null,{"$f":"IF($C13>0,D66-$C14/3630/$C13,D66)","v":0},{"$f":"IF($C13>0,E66-$C14/3630/$C13,E66)","v":0},{"$f":"IF($C13>0,F66-$C14/3630/$C13,F66)","v":0},null,null,null,2.1164434952407425E-3,4.9218365801390669E-2,0.44716746395683288,44.100000000000058,12.675736961451218]
[null,null,"Adjusted CN for D.A. C",{"$f":"IF(D67>0,VLOOKUP(D67,J$26:$N$626,4),0)","v":0},{"$f":"IF(E67>0,VLOOKUP(E67,K$26:$N$626,3),0)","v":0},{"$f":"IF(F67>0,VLOOKUP(F67,L$26:$N$626,2),0)","v":0},null,null,null,2.3957570007617553E-3,5.0619670573134636E-2,0.45189661523316882,44.20000000000006,12.624434389140241]
[null,null,null,null,null,null,null,null,null,2.6919857151320109E-3,5.203876608117803E-2,0.45664351831338501,44.300000000000061,12.573363431151211]
[null,null,null,null,null,null,null,null,null,3.0050664108893883E-3,5.3475588672880436E-2,0.4614081027839857,44.400000000000063,12.52252252252249]
["Drainage Area D",null,null,"A soils","B Soils","C Soils","D Soils",null,null,3.3349366203707419E-3,5.4930075444728936E-2,0.4661902989480956,44.500000000000064,12.471910112359517]
["Forest/Preserved Open Space ",null,"Area (acres)",{"$f":"'D.A. D'!$B$8","v":0},{"$f":"'D.A. D'!$C$8","v":0},{"$f":"'D.A. D'!$D$8","v":0},{"$f":"'D.A. D'!$E$8","v":0},null,null,3.6815346280922191E-3,5.6402164234632866E-2,0.47099003781760379,44.600000000000065,12.421524663677097]
[null,null,"CN",30,55,70,77,null,null,4.0447994632368672E-3,5.7891793614324984E-2,0.47580725110541255,44.700000000000067,12.371364653243816]
["Managed Turf ",null,"Area (acres)",{"$f":"'D.A. D'!$B$9","v":0},{"$f":"'D.A. D'!$C$9","v":0},{"$f":"'D.A. D'!$D$9","v":0},{"$f":"'D.A. D'!$E$9","v":0},null,null,4.4246708922479451E-3,5.9398902881867652E-2,0.48064187121779073,44.800000000000068,12.321428571428537]
[null,null,"CN",39,61,74,80,null,null,4.8210894115261809E-3,6.0923432054261983E-2,0.48549383124682804,44.90000000000007,12.271714922048965]
["Impervious Cover ",null,"Area (acres)",{"$f":"'D.A. D'!$B$10","v":0},{"$f":"'D.A. D'!$C$10","v":0},{"$f":"'D.A. D'!$D$10","v":0},{"$f":"'D.A. D'!$E$10","v":0},null,null,5.2339962402298459E-3,6.2465321860160031E-2,0.49036306496299409,45.000000000000071,12.222222222222186]
[null,null,"CN",98,98,98,98,null,null,5.6633333131753541E-3,6.4024513732675703E-2,0.49524950680779234,45.100000000000072,12.172949002217258]
[null,null,null,null,null,null,"Weighted CN","S",null,6.1090432738376346E-3,6.5600949802295694E-2,0.50015309188651591,45.200000000000074,12.123893805309699]
[null,null,null,null,null,null,{"$f":"IF(C17>0,(SUMPRODUCT(D72:G72,D73:G73)+SUMPRODUCT(D74:G74,D75:G75)+SUMPRODUCT(D76:G76,D77:G77))/C17,0)","v":0},{"$f":"IF(G79>0,1000/G79-10,1000)","v":1000},null,6.5710694674482734E-3,6.71945728898872E-2,0.5050737559610986,45.300000000000075,12.075055187637933]
[null,null,null,{"$f":"D46","v":0},{"$f":"E46","v":0},{"$f":"F46","v":0},null,null,null,7.0493559341899296E-3,6.8805326499800756E-2,0.51001143544305849,45.400000000000077,12.026431718061637]
["RVDeveloped (in) with no Runoff Reduction",null,null,{"$f":"IF(D$2>0.2*($H79),(D$2-0.2*($H79))^2/(D$2+0.8*($H79)),0)","v":0},{"$f":"IF(E$2>0.2*($H79),(E$2-0.2*($H79))^2/(E$2+0.8*($H79)),0)","v":0},{"$f":"IF(F$2>0.2*($H79),(F$2-0.2*($H79))^2/(F$2+0.8*($H79)),0)","v":0},null,null,null,7.5438474024860829E-3,7.0433154813068596E-2,0.51496606738653916,45.500000000000078,11.978021978021939]
["RVDeveloped (in) with Runoff Reduction",null,null,{"$f":"IF($C17>0,D81-$C18/3630/$C17,D81)","v":0},{"$f":"IF($C17>0,E81-$C18/3630/$C17,E81)","v":0},{"$f":"IF($C17>0,F81-$C18/3630/$C17,F81)","v":0},null,null,null,8.0544892823838903E-3,7.207800268069442E-2,0.51993758948143831,45.60000000000008,11.929824561403471]
[null,null,"Adjusted CN for D.A. D",{"$f":"IF(D82>0,VLOOKUP(D82,J$26:$N$626,4),0)","v":0},{"$f":"IF(E82>0,VLOOKUP(E82,K$26:$N$626,3),0)","v":0},{"$f":"IF(F82>0,VLOOKUP(F82,L$26:$N$626,2),0)","v":0},null,null,null,8.5812276590297946E-3,7.3739815617036394E-2,0.52492594004663318,45.700000000000081,11.88183807439821]
[null,null,null,null,null,null,null,null,null,9.1240092862351716E-3,7.5418539793277964E-2,0.52993105802328699,45.800000000000082,11.83406113537114]
[null,null,null,null,null,null,null,null,null,9.6827815801322232E-3,7.7114122030989857E-2,0.53495288296825172,45.900000000000084,11.786492374727629]
["Drainage Area E",null,null,"A soils","B Soils","C Soils","D Soils",null,null,1.0257492612917361E-2,7.8826509795777572E-2,0.53999135504755169,46.000000000000085,11.739130434782567]
["Forest/Preserved Open Space ",null,"Area (acres)",{"$f":"'D.A. E'!$B$8","v":0},{"$f":"'D.A. E'!$C$8","v":0},{"$f":"'D.A. E'!$D$8","v":0},{"$f":"'D.A. E'!$E$8","v":0},null,null,1.0848091106681581E-2,8.0555651191015487E-2,0.54504641502995366,46.100000000000087,11.691973969631196]
[null,null,"CN",30,55,70,77,null,null,1.145452642732662E-2,8.2301494951666512E-2,0.55011800428062307,46.200000000000088,11.645021645021604]
["Managed Turf ",null,"Area (acres)",{"$f":"'D.A. E'!$B$9","v":0},{"$f":"'D.A. E'!$C$9","v":0},{"$f":"'D.A. E'!$D$9","v":0},{"$f":"'D.A. E'!$E$9","v":0},null,null,1.2076748578565093E-2,8.4063990438184397E-2,0.55520606475486045,46.30000000000009,11.5982721382289]
[null,null,"CN",39,61,74,80,null,null,{"$f":"IF(D$2>0.2*($N90),(D$2-0.2*($N90))^2/(D$2+0.8*($N90)),0)","v":1.2714708196003637E-2},{"$f":"IF(E$2>0.2*($N90),(E$2-0.2*($N90))^2/(E$2+0.8*($N90)),0)","v":8.5843087630498235E-2},{"$f":"IF(F$2>0.2*($N90),(F$2-0.2*($N90))^2/(F$2+0.8*($N90)),0)","v":0.56031053899191985},46.400000000000091,{"$f":"IF(M90>0,1000/M90-10,1000)","v":11.551724137930993}]
["Impervious Cover ",null,"Area (acres)",{"$f":"'D.A. E'!$B$10","v":0},{"$f":"'D.A. E'!$C$10","v":0},{"$f":"'D.A. E'!$D$10","v":0},{"$f":"'D.A. E'!$E$10","v":0},null,null,1.3368356541308303E-2,8.7638737122079327E-2,0.5654313701089092,{"$f":"M90+0.1","v":46.500000000000092},11.505376344085978]
[null,null,"CN",98,98,98,98,null,null,1.4037645496449883E-2,8.9450890114085774E-2,0.5705685017947657,46.600000000000094,11.459227467811115]
[null,null,null,null,null,null,"Weighted CN","S",null,1.4722527558029488E-2,9.1279498409588128E-2,0.57572187830431432,46.700000000000095,11.413276231263339]
[null,null,null,null,null,null,{"$f":"IF(C21>0,(SUMPRODUCT(D87:G87,D88:G88)+SUMPRODUCT(D89:G89,D90:G90)+SUMPRODUCT(D91:G91,D92:G92))/C21,0)","v":0},{"$f":"IF(G94>0,1000/G94-10,1000)","v":1000},null,1.5422955831681776E-2,9.3124514407870673E-2,0.5808914444523986,46.800000000000097,11.367521367521324]
[null,null,null,{"$f":"D61","v":0},{"$f":"E61","v":0},{"$f":"F61","v":0},null,null,null,1.6138884026555868E-2,9.4985891098810574E-2,0.58607714560808999,46.900000000000098,11.32196162046904]
["RVDeveloped (in) with no Runoff Reduction",null,null,{"$f":"IF(D$2>0.2*($H94),(D$2-0.2*($H94))^2/(D$2+0.8*($H94)),0)","v":0},{"$f":"IF(E$2>0.2*($H94),(E$2-0.2*($H94))^2/(E$2+0.8*($H94)),0)","v":0},{"$f":"IF(F$2>0.2*($H94),(F$2-0.2*($H94))^2/(F$2+0.8*($H94)),0)","v":0},null,null,null,1.6870266449871975E-2,9.6863582057331143E-2,0.59127892768896884,47.000000000000099,11.276595744680805]
["RVDeveloped (in) with Runoff Reduction",null,null,{"$f":"IF($C21>0,D96-$C22/3630/$C21,D96)","v":0},{"$f":"IF($C21>0,E96-$C22/3630/$C21,E96)","v":0},{"$f":"IF($C21>0,F96-$C22/3630/$C21,F96)","v":0},null,null,null,1.7617058001552815E-2,9.8757541437929169E-2,0.59649673715547913,47.100000000000101,11.231422505307812]
[null,null,"Adjusted CN for D.A. E",{"$f":"IF(D97>0,VLOOKUP(D97,J$26:$N$626,4),0)","v":0},{"$f":"IF(E97>0,VLOOKUP(E97,K$26:$N$626,3),0)","v":0},{"$f":"IF(F97>0,VLOOKUP(F97,L$26:$N$626,2),0)","v":0},null,null,null,1.8379214168930097E-2,0.10066772396927799,0.6017305210053614,47.200000000000102,11.186440677966054]
[null,null,null,null,null,null,null,null,null,1.9156691021521826E-2,0.1025940849488977,0.60698022676814367,47.300000000000104,11.141649048625748]
[null,null,null,null,null,null,null,null,null,1.9949445205883699E-2,0.10453658023790194,0.61224580249971894,47.400000000000105,11.097046413502063]
[null,null,null,null,null,null,null,null,null,2.0757433940529368E-2,0.10649516625581001,0.61752719677697743,47.500000000000107,11.05263157894732]
[null,null,null,null,null,null,null,null,null,2.1580615010921626E-2,0.10846979997543067,0.62282435869251485,47.600000000000108,11.008403361344492]
[null,null,null,null,null,null,null,null,null,2.241894676453219E-2,0.1104604389178134,0.62813723784940667,47.700000000000109,10.964360587002048]
[null,null,null,null,null,null,null,null,null,2.327238810596877E-2,0.11246704114726541,0.63346578435604539,47.800000000000111,10.92050209205016]
[null,null,null,null,null,null,null,null,null,2.4140898492169872E-2,0.1144895652664366,0.6388099488210468,47.900000000000112,10.876826722338155]
[null,null,null,null,null,null,null,null,null,2.5024437927664768E-2,0.11652797041146792,0.64416968234821703,48.000000000000114,10.833333333333282]
[null,null,null,null,null,null,null,null,null,2.5922966959899055E-2,0.11858221624720516,0.64954493653158518,48.100000000000115,10.790020790020741]
[null,null,null,null,null,null,null,null,null,2.6836446674623999E-2,0.12065226296247514,0.65493566345049781,48.200000000000117,10.74688796680493]
[null,null,null,null,null,null,null,null,null,2.776483869134927E-2,0.1227380712654247,0.66034181566477357,48.300000000000118,10.703933747411959]
[null,null,null,null,null,null,null,null,null,2.8708105158858035E-2,0.12483960237892128,0.6657633462099205,48.400000000000119,10.661157024793336]
[null,null,null,null,null,null,null,null,null,2.966620875078323E-2,0.12695681803601305,0.67120020859240903,48.500000000000121,10.618556701030876]
[null,null,null,null,null,null,null,null,null,3.0639112661245142E-2,0.12908968047545069,0.67665235678501023,48.600000000000122,10.576131687242746]
[null,null,null,null,null,null,null,null,null,3.1626780600548181E-2,0.1312381524372663,0.6821197452221851,48.700000000000124,10.533880903490708]
[null,null,null,null,null,null,null,null,null,3.2629176790937048E-2,0.13340219715841167,0.68760232879553596,48.800000000000125,10.491803278688472]
[null,null,null,null,null,null,null,null,null,3.3646265962410757E-2,0.13558177836845262,0.69310006284931114,48.900000000000126,10.449897750511195]
[null,null,null,null,null,null,null,null,null,3.4678013348594522E-2,0.13777686028532118,0.69861290317596669,49.000000000000128,10.408163265306069]
[null,null,null,null,null,null,null,null,null,3.5724384682667962E-2,0.13998740761112255,0.70414080601178342,49.100000000000129,10.366598778004018]
[null,null,null,null,null,null,null,null,null,3.6785346193349104E-2,0.14221338552799709,0.70968372803253454,49.200000000000131,10.325203252032466]
[null,null,null,null,null,null,null,null,null,{"$f":"IF(D$2>0.2*($N119),(D$2-0.2*($N119))^2/(D$2+0.8*($N119)),0)","v":3.7860864600933977E-2},{"$f":"IF(E$2>0.2*($N119),(E$2-0.2*($N119))^2/(E$2+0.8*($N119)),0)","v":0.14445475969403698},{"$f":"IF(F$2>0.2*($N119),(F$2-0.2*($N119))^2/(F$2+0.8*($N119)),0)","v":0.71524162634921162},{"$f":"M118+0.1","v":49.300000000000132},{"$f":"IF(M119>0,1000/M119-10,1000)","v":10.283975659229153}]
[null,null,null,null,null,null,null,null,null,3.8950907113389908E-2,0.14671149623925561,0.72081445850379733,{"$f":"M119+0.1","v":49.400000000000134},10.242914979757032]
[null,null,null,null,null,null,null,null,null,4.0055441422503273E-2,0.14898356176161071,0.72640218246509558,49.500000000000135,10.202020202020147]
[null,null,null,null,null,null,null,null,null,4.1174435700079344E-2,0.15127092332307773,0.7320047566246064,49.600000000000136,10.161290322580591]
[null,null,null,null,null,null,null,null,null,4.2307858594195176E-2,0.1535735484457767,0.73762213979245761,49.700000000000138,10.120724346076404]
[null,null,null,null,null,null,null,null,null,4.345567922550337E-2,0.15589140510814753,0.74325429119338005,49.800000000000139,10.080321285140506]
[null,null,null,null,null,null,null,null,null,4.4617867183587345E-2,0.15822446174117683,0.74890117046273608,49.900000000000141,10.040080160320585]
[null,null,null,null,null,null,null,null,null,4.579439252336618E-2,0.16057268722467297,0.75456273764259385,50.000000000000142,9.9999999999999432]
[null,null,null,null,null,null,null,null,null,4.6985225761549593E-2,0.16293605088359001,0.76023895317784895,50.100000000000144,9.9600798403193025]
[null,null,null,null,null,null,null,null,null,4.8190337873141177E-2,0.1653145224843991,0.7659297779123948,50.200000000000145,9.9203187250995448]
[null,null,null,null,null,null,null,null,null,4.9409700287990965E-2,0.16770807223150877,0.77163517308533813,50.300000000000146,9.8807157057653505]
[null,null,null,null,null,null,null,null,null,5.0643284887394273E-2,0.17011667076372911,0.77735510032725863,50.400000000000148,9.8412698412697814]
[null,null,null,null,null,null,null,null,null,5.1891064000738348E-2,0.17254028915078354,0.78308952165651435,50.500000000000149,9.801980198019745]
[null,null,null,null,null,null,null,null,null,5.3153010402195951E-2,0.17497889888986715,0.78883839947559498,50.600000000000151,9.7628458498023143]
[null,null,null,null,null,null,null,null,null,5.4429097307463564E-2,0.17743247190224706,0.79460169656751223,50.700000000000152,9.7238658777119724]
[null,null,null,null,null,null,null,null,null,5.5719298370545386E-2,0.17990098052990841,0.80037937609223697,50.800000000000153,9.6850393700786803]
[null,null,null,null,null,null,null,null,null,5.7023587680582612E-2,0.18238439753224461,0.80617140158318001,50.900000000000155,9.6463654223967978]
[null,null,null,null,null,null,null,null,null,5.8341939758725994E-2,0.18488269608278979,0.81197773694371345,51.000000000000156,9.607843137254843]
[null,null,null,null,null,null,null,null,null,5.9674329555052058E-2,0.18739584976599302,0.81779834644373062,51.100000000000158,9.569471624266086]
[null,null,null,null,null,null,null,null,null,6.1020732445522724E-2,0.18992383257403589,0.82363319471625207,51.200000000000159,9.5312499999999396]
[null,null,null,null,null,null,null,null,null,6.2381124228987055E-2,0.19246661890369038,0.82948224675406712,51.300000000000161,9.4931773879141694]
[null,null,null,null,null,null,null,null,null,6.3755481124225147E-2,0.19502418355321816,0.83534546790641895,51.400000000000162,9.4552529182878757]
[null,null,null,null,null,null,null,null,null,6.5143779767033144E-2,0.19759650171930954,0.84122282387572433,51.500000000000163,9.4174757281552779]
[null,null,null,null,null,null,null,null,null,6.6545997207349425E-2,0.20018354899406277,0.84711428071433625,51.600000000000165,9.3798449612402486]
[null,null,null,null,null,null,null,null,null,6.7962110906421402E-2,0.20278530136200254,0.85301980482134354,51.700000000000166,9.3423597678916188]
[null,null,null,null,null,null,null,null,null,6.939209873401106E-2,0.20540173519713595,0.85893936293940343,51.800000000000168,9.3050193050192433]
[null,null,null,null,null,null,null,null,null,7.0835938965641942E-2,0.20803282726004962,0.86487292215162093,51.900000000000169,9.2678227360307659]
[null,null,null,null,null,null,null,null,null,7.2293610279882861E-2,0.21067855469504088,0.87082044987845364,52.000000000000171,9.230769230769166]
[null,null,null,null,null,null,null,null,null,7.3765091755671405E-2,0.21333889502728859,0.87678191387465987,52.100000000000172,9.1938579654509915]
[null,null,null,null,null,null,null,null,null,7.5250362869675333E-2,0.21601382616006079,0.88275728222628125,52.200000000000173,9.1570881226053018]
[null,null,null,null,null,null,null,null,null,7.6749403493691318E-2,0.21870332637195786,0.88874652334765958,52.300000000000175,9.1204588910133211]
[null,null,null,null,null,null,null,null,null,7.826219389208007E-2,0.22140737431419061,0.89474960597848496,52.400000000000176,9.0839694656487922]
[null,null,null,null,null,null,null,null,null,7.978871471923972E-2,0.2241259490078967,0.90076649918088614,52.500000000000178,9.0476190476189835]
[null,null,null,null,null,null,null,null,null,8.1328947017113698E-2,0.22685902984148876,0.90679717233654666,52.600000000000179,9.0114068441063999]
[null,null,null,null,null,null,null,null,null,8.2882872212735645E-2,0.22960659656803942,0.91284159514385876,52.70000000000018,8.9753320683111291]
[null,null,null,null,null,null,null,null,null,8.4450472115808778E-2,0.23236862930269878,0.91889973761510801,52.800000000000182,8.9393939393938737]
[null,null,null,null,null,null,null,null,null,8.6031728916321007E-2,0.23514510852014686,0.92497157007369224,52.900000000000183,8.9035916824195951]
[null,null,null,null,null,null,null,null,null,8.7626625182194259E-2,0.23793601505207909,0.93105706315137216,53.000000000000185,8.8679245283018204]
[null,null,null,null,null,null,null,null,null,8.9235143856967056E-2,0.24074133008472245,0.93715618778554921,53.100000000000186,8.8323917137475796]
[null,null,null,null,null,null,null,null,null,9.0857268257512697E-2,0.24356103515638811,0.94326891521658263,53.200000000000188,8.7969924812029419]
[null,null,null,null,null,null,null,null,null,9.2492982071789187E-2,0.24639511215505244,0.94939521698512963,53.300000000000189,8.7617260787991817]
[null,null,null,null,null,null,null,null,null,9.4142269356622371E-2,0.24924354331597087,0.95553506492952034,53.40000000000019,8.7265917602995593]
[null,null,null,null,null,null,null,null,null,9.5805114535522928E-2,0.25210631121932459,0.96168843118316194,53.500000000000192,8.6915887850466618]
[null,null,null,null,null,null,null,null,null,9.7481502396533526E-2,0.25498339878789483,0.96785528817196964,53.600000000000193,8.6567164179103813]
[null,null,null,null,null,null,null,null,null,9.9171418090109723E-2,0.25787478928477092,0.97403560861183192,53.700000000000195,8.6219739292364324]
[null,null,null,null,null,null,null,null,null,0.10087484712703131,0.26078046631108664,0.98022936550610007,53.800000000000196,8.5873605947954701]
[null,null,null,null,null,null,null,null,null,0.10259177537634462,0.26370041380378573,0.98643653214310612,53.900000000000198,8.5528756957327694]
[null,null,null,null,null,null,null,null,null,0.10432218906333687,0.26663461603341937,0.99265708209371417,54.000000000000199,8.5185185185184515]
[null,null,null,null,null,null,null,null,null,0.10606607476754003,0.26958305760197054,0.99889098920889352,54.1000000000002,8.4842883548982684]
[null,null,null,null,null,null,null,null,null,0.10782341942076398,0.27254572344070649,1.0051382276173204,54.200000000000202,8.4501845018449515]
[null,null,null,null,null,null,null,null,null,0.109594210305162,0.27552259880806296,1.0113987717230097,54.300000000000203,8.4162062615100588]
[null,null,null,null,null,null,null,null,null,0.1113784350513226,0.27851366928755161,1.0176725962029696,54.400000000000205,8.3823529411764]
[null,null,null,null,null,null,null,null,null,0.11317608163639306,0.28151892078569968,1.0239596760048846,54.500000000000206,8.3486238532109383]
[null,null,null,null,null,null,null,null,null,0.11498713838223044,0.28453833953001406,1.0302599863448239,54.600000000000207,8.3150183150182464]
[null,null,null,null,null,null,null,null,null,0.11681159395358191,0.28757191206697408,1.0365735027049769,54.700000000000209,8.2815356489944456]
[null,null,null,null,null,null,null,null,null,0.11864943735629184,0.29061962526004914,1.0429002008314106,54.80000000000021,8.2481751824816811]
[null,null,null,null,null,null,null,null,null,0.12050065793553878,0.29368146628774466,1.0492400567318545,54.900000000000212,8.2149362477230632]
[null,null,null,null,null,null,null,null,null,0.12236524537409892,0.29675742264167354,1.0555930466735111,55.000000000000213,8.1818181818181124]
[null,null,null,null,null,null,null,null,null,0.12424318969063661,0.29984748212465262,1.0619591471808876,55.100000000000215,8.1488203266786954]
[null,null,null,null,null,null,null,null,null,0.12613448123802298,0.30295163284882565,1.0683383350336546,55.200000000000216,8.1159420289854367]
[null,null,null,null,null,null,null,null,null,0.12803911070168017,0.30606986323381058,1.0747305872645265,55.300000000000217,8.0831826401445959]
[null,null,null,null,null,null,null,null,null,0.12995706909795329,0.30920216200487322,1.0811358811571667,55.400000000000219,8.050541516245417]
[null,null,null,null,null,null,null,null,null,0.13188834777250735,0.31234851819112308,1.0875541942441158,55.50000000000022,8.0180180180179477]
[null,null,null,null,null,null,null,null,null,0.13383293839875107,0.31550892112373674,1.0939855043047417,55.600000000000222,7.9856115107912942]
[null,null,null,null,null,null,null,null,null,{"$f":"IF(D$2>0.2*($N183),(D$2-0.2*($N183))^2/(D$2+0.8*($N183)),0)","v":0.13579083297628544},{"$f":"IF(E$2>0.2*($N183),(E$2-0.2*($N183))^2/(E$2+0.8*($N183)),0)","v":0.31868336043420126},{"$f":"IF(F$2>0.2*($N183),(F$2-0.2*($N183))^2/(F$2+0.8*($N183)),0)","v":1.1004297893632113},55.700000000000223,{"$f":"IF(M183>0,1000/M183-10,1000)","v":7.9533213644523535}]
[null,null,null,null,null,null,null,null,null,0.13776202382937958,0.32187182605258646,1.1068870276864906,{"$f":"M183+0.1","v":55.800000000000225},7.9211469534049463]
[null,null,null,null,null,null,null,null,null,0.13974650360546917,0.3250743082058356,1.1133571977823584,55.900000000000226,7.8890876565294441]
[null,null,null,null,null,null,null,null,null,0.1417442652736817,0.32829079741608286,1.1198402783974453,56.000000000000227,7.857142857142783]
[null,null,null,null,null,null,null,null,null,0.14375530212338586,0.33152128449899199,1.1263362485152975,56.100000000000229,7.8253119429589297]
[null,null,null,null,null,null,null,null,null,0.14577960776276594,0.33476576056211965,1.132845087354458,56.20000000000023,7.7935943060497479]
[null,null,null,null,null,null,null,null,null,0.14781717611741832,0.33802421700329782,1.1393667743665665,56.300000000000232,7.76198934280632]
[null,null,null,null,null,null,null,null,null,0.14986800142897511,0.3412966455090426,1.1459012892344873,56.400000000000233,7.7304964539006349]
[null,null,null,null,null,null,null,null,null,0.15193207825374866,0.34458303805298129,1.1524486118704507,56.500000000000234,7.6991150442477156]
[null,null,null,null,null,null,null,null,null,0.1540094014614023,0.34788338689430542,1.1590087224142196,56.600000000000236,7.6678445229681245]
[null,null,null,null,null,null,null,null,null,0.15609996623364084,0.35119768457623907,1.1655816012312696,56.700000000000237,7.6366843033508971]
[null,null,null,null,null,null,null,null,null,0.15820376806292799,0.3545259239245358,1.1721672289109979,56.800000000000239,7.6056338028168291]
[null,null,null,null,null,null,null,null,null,0.16032080275122396,0.35786809804599107,1.1787655862649435,56.90000000000024,7.5746924428821742]
[null,null,null,null,null,null,null,null,null,0.1624510664087464,0.36122420032697738,1.1853766543250293,57.000000000000242,7.5438596491227337]
[null,null,null,null,null,null,null,null,null,0.16459455545275509,0.36459422443200201,1.1920004143418272,57.100000000000243,7.5131348511382789]
[null,null,null,null,null,null,null,null,null,0.166751266606356,0.3679781643022802,1.198636847782834,57.200000000000244,7.4825174825174088]
[null,null,null,null,null,null,null,null,null,0.16892119689733096,0.3713760141543348,1.2052859363307737,57.300000000000246,7.4520069808027181]
[null,null,null,null,null,null,null,null,null,0.17110434365698593,0.37478776847861006,1.2119476618819129,57.400000000000247,7.4216027874563721]
[null,null,null,null,null,null,null,null,null,0.17330070451902313,0.37821342203810937,1.2186220065443962,57.500000000000249,7.3913043478260114]
[null,null,null,null,null,null,null,null,null,0.17551027741843306,0.38165296986704944,1.2253089526365992,57.60000000000025,7.3611111111110361]
[null,null,null,null,null,null,null,null,null,0.1777330605904093,0.38510640726953649,1.2320084826854991,57.700000000000252,7.3310225303292142]
[null,null,null,null,null,null,null,null,null,0.17996905256928294,0.38857372981825955,1.2387205794250635,57.800000000000253,7.3010380622836628]
[null,null,null,null,null,null,null,null,null,0.18221825218747958,0.39205493335320468,1.2454452257946564,57.900000000000254,7.2711571675301485]
[null,null,null,null,null,null,null,null,null,0.18448065857449455,0.39555001398038453,1.2521824049374575,58.000000000000256,7.241379310344751]
[null,null,null,null,null,null,null,null,null,0.18675627115589102,0.39905896807059021,1.2589321001989038,58.100000000000257,7.2117039586918352]
[null,null,null,null,null,null,null,null,null,0.18904508965231817,0.40258179225816032,1.2656942951251455,58.200000000000259,7.1821305841923646]
[null,null,null,null,null,null,null,null,null,0.1913471140785481,0.40611848343976664,1.2724689734615182,58.30000000000026,7.1526586620925485]
[null,null,null,null,null,null,null,null,null,0.1936623447425341,0.40966903877321947,1.2792561191510301,58.400000000000261,7.1232876712327986]
[null,null,null,null,null,null,null,null,null,0.19599078224448796,0.41323345567628933,1.2860557163328656,58.500000000000263,7.0940170940170155]
[null,null,null,null,null,null,null,null,null,0.1983324274759781,0.4168117318255487,1.2928677493409089,58.600000000000264,7.0648464163821743]
[null,null,null,null,null,null,null,null,null,0.20068728161904642,0.42040386515522882,1.2996922027022768,58.700000000000266,7.0357751277682361]
[null,null,null,null,null,null,null,null,null,0.20305534614534454,0.42400985385609474,1.3065290611358731,58.800000000000267,7.0068027210883592]
[null,null,null,null,null,null,null,null,null,0.20543662281528954,0.42762969637433756,1.3133783095509519,58.900000000000269,6.9779286926994146]
[null,null,null,null,null,null,null,null,null,0.20783111367723864,0.43126339141048298,1.3202399330457022,59.00000000000027,6.9491525423728042]
[null,null,null,null,null,null,null,null,null,0.21023882106668293,0.43491093791831692,1.3271139169058417,59.100000000000271,6.9204737732655737]
[null,null,null,null,null,null,null,null,null,0.21265974760546014,0.43857233510382865,1.334000246603231,59.200000000000273,6.8918918918918131]
[null,null,null,null,null,null,null,null,null,0.21509389620098557,0.44224758242416901,1.3408989077944984,59.300000000000274,6.863406408094356]
[null,null,null,null,null,null,null,null,null,0.21754127004550214,0.44593667958662597,1.3478098863196806,59.400000000000276,6.8350168350167557]
[null,null,null,null,null,null,null,null,null,0.22000187261534826,0.44963962654761491,1.3547331682008761,59.500000000000277,6.8067226890755528]
[null,null,null,null,null,null,null,null,null,0.22247570767024441,0.45335642351168709,1.3616687396409168,59.600000000000279,6.7785234899328088]
[null,null,null,null,null,null,null,null,null,0.22496277925259803,0.45708707093055256,1.3686165870220495,59.70000000000028,6.7504187604689321]
[null,null,null,null,null,null,null,null,null,0.2274630916868248,0.46083156950211668,1.3755766969046284,59.800000000000281,6.7224080267557724]
[null,null,null,null,null,null,null,null,null,0.22997664957869018,0.46458992016953676,1.3825490560258296,59.900000000000283,6.6944908180299727]
[null,null,null,null,null,null,null,null,null,0.23250345781466852,0.46836212412029238,1.3895336512983776,60.000000000000284,6.6666666666665861]
[null,null,null,null,null,null,null,null,null,0.23504352156131558,0.4721481827852666,1.3965304698092709,60.100000000000286,6.6389351081529995]
[null,null,null,null,null,null,null,null,null,0.2375968462646659,0.47594809783784975,1.4035394988185437,60.200000000000287,6.6112956810630443]
[null,null,null,null,null,null,null,null,null,0.2401634376496409,0.47976187119305269,1.410560725758023,60.300000000000288,6.5837479270314283]
[null,null,null,null,null,null,null,null,null,0.24274330171947719,0.48358950500663572,1.4175941382301023,60.40000000000029,6.5562913907283971]
[null,null,null,null,null,null,null,null,null,0.2453364447551728,0.48743100167425507,1.4246397240065354,60.500000000000291,6.5289256198346308]
[null,null,null,null,null,null,null,null,null,0.2479428733149488,0.4912863638306208,1.4316974710272334,60.600000000000293,6.5016501650164216]
[null,null,null,null,null,null,null,null,null,0.25056259423372806,0.49515559434866968,1.4387673673990782,60.700000000000294,6.474464579901074]
[null,null,null,null,null,null,null,null,null,0.25319561462263263,0.49903869633875497,1.4458494013947509,60.800000000000296,6.4473684210525519]
[null,null,null,null,null,null,null,null,null,0.25584194186849502,0.50293567314784604,1.4529435614515651,60.900000000000297,6.4203612479473762]
[null,null,null,null,null,null,null,null,null,0.2585015836333891,0.50684652835874655,1.4600498361703205,61.000000000000298,6.3934426229507402]
[null,null,null,null,null,null,null,null,null,0.26117454785417477,0.51077126578932253,1.4671682143141607,61.1000000000003,6.3666121112928806]
[null,null,null,null,null,null,null,null,null,0.26386084274206101,0.51470988949174667,1.4742986848074482,61.200000000000301,6.3398692810456723]
[null,null,null,null,null,null,null,null,null,0.26656047678218592,0.51866240375175832,1.4814412367346519,61.300000000000303,6.3132137030994286]
[null,null,null,null,null,null,null,null,null,0.26927345873320957,0.52262881308792963,1.488595859339237,61.400000000000304,6.2866449511399836]
[null,null,null,null,null,null,null,null,null,0.27199979762692672,0.52660912225095458,1.4957625420225769,61.500000000000306,6.260162601625936]
[null,null,null,null,null,null,null,null,null,0.27473950276789422,0.53060333622294487,1.5029412743428718,61.600000000000307,6.2337662337661541]
[null,null,null,null,null,null,null,null,null,0.27749258373307406,0.53461146021674144,1.5101320460140772,61.700000000000308,6.2074554294974895]
[null,null,null,null,null,null,null,null,null,0.2802590503714924,0.53863349967523866,1.517334846904844,61.80000000000031,6.1812297734627037]
[null,null,null,null,null,null,null,null,null,0.28303891280391547,0.54266946027072183,1.5245496670374719,61.900000000000311,6.1550888529886087]
[null,null,null,null,null,null,null,null,null,0.2858321814225388,0.54671934790421561,1.5317764965868681,62.000000000000313,6.1290322580644343]
[null,null,null,null,null,null,null,null,null,{"$f":"IF(D$2>0.2*($N247),(D$2-0.2*($N247))^2/(D$2+0.8*($N247)),0)","v":0.28863886689069634},{"$f":"IF(E$2>0.2*($N247),(E$2-0.2*($N247))^2/(E$2+0.8*($N247)),0)","v":0.55078316870485111},{"$f":"IF(F$2>0.2*($N247),(F$2-0.2*($N247))^2/(F$2+0.8*($N247)),0)","v":1.5390153258795249},62.100000000000314,{"$f":"IF(M247>0,1000/M247-10,1000)","v":6.1030595813203696}]
[null,null,null,null,null,null,null,null,null,0.2914589801425807,0.55486092902923778,1.5462661453925,{"$f":"M247+0.1","v":62.200000000000315},6.0771704180063502]
[null,null,null,null,null,null,null,null,null,0.29429253238298153,0.55895263546085372,1.55352894575241,62.300000000000317,6.0513643659710254]
[null,null,null,null,null,null,null,null,null,0.29713953508703822,0.56305829480944547,1.560803717734434,62.400000000000318,6.0256410256409438]
[null,null,null,null,null,null,null,null,null,0.30000000000000915,0.56717791411044272,1.5680904522613299,62.50000000000032,5.9999999999999183]
[null,null,null,null,null,null,null,null,null,0.30287393913705507,0.5713115006243823,1.5753891404024554,62.600000000000321,5.9744408945686089]
[null,null,null,null,null,null,null,null,null,0.30576136478303817,0.57545906183634721,1.582699773372803,62.700000000000323,5.9489633173842886]
[null,null,null,null,null,null,null,null,null,0.30866228949233693,0.57962060545541649,1.590022342532045,62.800000000000324,5.9235668789808091]
[null,null,null,null,null,null,null,null,null,0.31157672608867415,0.58379613941412667,1.5973568393835833,62.900000000000325,5.8982511923687575]
[null,null,null,null,null,null,null,null,null,0.31450468766496342,0.58798567186794592,1.604703255573616,63.000000000000327,5.87301587301579]
[null,null,null,null,null,null,null,null,null,0.31744618758316662,0.59218921119475987,1.6120615828902074,63.100000000000328,5.8478605388271756]
[null,null,null,null,null,null,null,null,null,0.3204012394741696,0.5964067659943697,1.6194318132623708,63.20000000000033,5.8227848101264996]
[null,null,null,null,null,null,null,null,null,0.3233698572376712,0.60063834508800096,1.6268139387591596,63.300000000000331,5.7977883096365677]
[null,null,null,null,null,null,null,null,null,0.32635205504208648,0.60488395751782453,1.6342079515887646,63.400000000000333,5.7728706624604857]
[null,null,null,null,null,null,null,null,null,0.3293478473244672,0.60914361254648952,1.6416138440976296,63.500000000000334,5.7480314960629091]
[null,null,null,null,null,null,null,null,null,0.33235724879043371,0.61341731965666524,1.6490316087695613,63.600000000000335,5.7232704402514898]
[null,null,null,null,null,null,null,null,null,0.33538027441412449,0.61770508855060013,1.6564612382248634,63.700000000000337,5.698587127158472]
[null,null,null,null,null,null,null,null,null,0.33841693943815787,0.62200692914968347,1.663902725219468,63.800000000000338,5.673981191222488]
[null,null,null,null,null,null,null,null,null,0.341467259373611,0.62632285159402723,1.6713560626440829,63.90000000000034,5.6494522691704958]
[null,null,null,null,null,null,null,null,null,0.34453125000001056,0.63065286624205286,1.6788212435233416,64.000000000000341,5.6249999999999165]
[null,null,null,null,null,null,null,null,null,0.34760892736533927,0.63499698367009128,1.6862982610149686,64.100000000000335,5.6006240249609167]
[null,null,null,null,null,null,null,null,null,0.35070030778605815,0.63935521467199419,1.6937871084089482,64.20000000000033,5.5763239875388599]
[null,null,null,null,null,null,null,null,null,0.3538054078471401,0.64372757025875527,1.7012877791266987,64.300000000000324,5.5520995334369356]
[null,null,null,null,null,null,null,null,null,0.35692424440212089,0.64811406165814367,1.7088002667202657,64.400000000000318,5.5279503105589303]
[null,null,null,null,null,null,null,null,null,0.36005683457316268,0.65251470031434666,1.7163245648715133,64.500000000000313,5.5038759689921726]
[null,null,null,null,null,null,null,null,null,0.3632031957511318,0.65692949788762267,1.7238606673913246,64.600000000000307,5.4798761609906386]
[null,null,null,null,null,null,null,null,null,0.3663633455956925,0.66135846625396921,1.7314085682188169,64.700000000000301,5.455950540958197]
[null,null,null,null,null,null,null,null,null,0.36953730203541324,0.66580161750479383,1.7389682614205582,64.800000000000296,5.4320987654320287]
[null,null,null,null,null,null,null,null,null,0.37272508326788706,0.670258963946603,1.7465397411897923,64.90000000000029,5.4083204930661868]
[null,null,null,null,null,null,null,null,null,0.37592670775986725,0.6747305181006964,1.754123001845675,65.000000000000284,5.3846153846153175]
[null,null,null,null,null,null,null,null,null,0.37914219424741769,0.6792162927028762,1.7617180378325157,65.100000000000279,5.3609831029185209]
[null,null,null,null,null,null,null,null,null,0.38237156173607384,0.68371630070315903,1.7693248437190239,65.200000000000273,5.3374233128833719]
[null,null,null,null,null,null,null,null,null,0.38561482950102327,0.68823055526550869,1.7769434141975715,65.300000000000267,5.3139356814700758]
[null,null,null,null,null,null,null,null,null,0.38887201708729424,0.69275906976756829,1.7845737440834504,65.400000000000261,5.2905198776757807]
[null,null,null,null,null,null,null,null,null,0.39214314430996405,0.69730185780041221,1.7922158283141494,65.500000000000256,5.2671755725190241]
[null,null,null,null,null,null,null,null,null,0.39542823125437609,0.70185893316829928,1.7998696619486292,65.60000000000025,5.2439024390243318]
[null,null,null,null,null,null,null,null,null,0.3987272982763756,0.70643030988844302,1.8075352401666112,65.700000000000244,5.2207001522069447]
[null,null,null,null,null,null,null,null,null,0.40204036600255655,0.71101600219078887,1.8152125582678686,65.800000000000239,5.1975683890576949]
[null,null,null,null,null,null,null,null,null,0.40536745533052254,0.7156160245178006,1.8229016116715273,65.900000000000233,5.1745068285280187]
[null,null,null,null,null,null,null,null,null,0.40870858742916377,0.72023039152425716,1.8306023959153732,66.000000000000227,5.151515151515099]
[null,null,null,null,null,null,null,null,null,0.41206378373894509,0.72485911807706116,1.8383149066551647,66.100000000000222,5.1285930408471501]
[null,null,null,null,null,null,null,null,null,0.4154330659722103,0.72950221925505454,1.8460391396639551,66.200000000000216,5.1057401812688337]
[null,null,null,null,null,null,null,null,null,0.41881645611349982,0.73415971034884475,1.8537750908314186,66.30000000000021,5.0829562594267994]
[null,null,null,null,null,null,null,null,null,0.42221397641988057,0.73883160686064153,1.8615227561631851,66.400000000000205,5.0602409638553745]
[null,null,null,null,null,null,null,null,null,0.42562564942129205,0.74351792450410203,1.8692821317801804,66.500000000000199,5.0375939849623617]
[null,null,null,null,null,null,null,null,null,0.42905149792090658,0.74821867920418728,1.8770532139179765,66.600000000000193,5.0150150150149706]
[null,null,null,null,null,null,null,null,null,0.43249154499549913,0.75293388709702402,1.8848359989261385,66.700000000000188,4.9925037481258947]
[null,null,null,null,null,null,null,null,null,0.43594581399583737,0.75766356452978256,1.892630483267592,66.800000000000182,4.9700598802394804]
[null,null,null,null,null,null,null,null,null,0.43941432854708079,0.76240772806055757,1.9004366635179857,66.900000000000176,4.9476831091180475]
[null,null,null,null,null,null,null,null,null,0.4428971125491955,0.76716639445826262,1.9082545363650647,67.000000000000171,4.9253731343283196]
[null,null,null,null,null,null,null,null,null,0.44639419017738197,0.77193958070253077,1.9160840986080487,67.100000000000165,4.9031296572279821]
[null,null,null,null,null,null,null,null,null,0.44990558588252022,0.77672730398362944,1.9239253471570192,67.200000000000159,4.8809523809523458]
[null,null,null,null,null,null,null,null,null,0.45343132439162193,0.78152958170237663,1.9317782790323088,67.300000000000153,4.8588410104011555]
[null,null,null,null,null,null,null,null,null,0.45697143070830448,0.78634643147007588,1.9396428913638992,67.400000000000148,4.8367952522254871]
[null,null,null,null,null,null,null,null,null,0.46052593011327281,0.79117787110845161,1.9475191813908244,67.500000000000142,4.8148148148147829]
[null,null,null,null,null,null,null,null,null,0.46409484816481739,0.79602391864959865,1.9554071464605784,67.600000000000136,4.7928994082839935]
[null,null,null,null,null,null,null,null,null,0.46767821069932763,0.800884592335942,1.9633067840285321,67.700000000000131,4.7710487444608276]
[null,null,null,null,null,null,null,null,null,0.47127604383181659,0.80575991062019936,1.9712180916573536,67.800000000000125,4.7492625368731289]
[null,null,null,null,null,null,null,null,null,0.47488837395646061,0.81064989216535976,1.9791410670164324,67.900000000000119,4.7275405007363513]
[null,null,null,null,null,null,null,null,null,0.47851522774715383,0.81555455584466652,1.9870757078813142,68.000000000000114,4.7058823529411526]
[null,null,null,null,null,null,null,null,null,0.4821566321580758,0.82047392074161196,1.9950220121331372,68.100000000000108,4.6842878120410933]
[null,null,null,null,null,null,null,null,null,0.48581261442427243,0.82540800614993937,2.0029799777580761,68.200000000000102,4.6627565982404473]
[null,null,null,null,null,null,null,null,null,0.4894832020622521,0.83035683157365225,2.0109496028467899,68.300000000000097,4.6412884333821172]
[null,null,null,null,null,null,null,null,null,0.4931684228705962,0.83532041672703894,2.0189308855938775,68.400000000000091,4.6198830409356528]
[null,null,null,null,null,null,null,null,null,{"$f":"IF(D$2>0.2*($N311),(D$2-0.2*($N311))^2/(D$2+0.8*($N311)),0)","v":0.49686830493058121},{"$f":"IF(E$2>0.2*($N311),(E$2-0.2*($N311))^2/(E$2+0.8*($N311)),0)","v":0.84029878153469673},{"$f":"IF(F$2>0.2*($N311),(F$2-0.2*($N311))^2/(F$2+0.8*($N311)),0)","v":2.026923824297334},68.500000000000085,{"$f":"IF(M311>0,1000/M311-10,1000)","v":4.5985401459853836}]
[null,null,null,null,null,null,null,null,null,0.50058287660681822,0.84529194613157366,2.0349284173580209,{"$f":"M311+0.1","v":68.60000000000008},4.5772594752186428]
[null,null,null,null,null,null,null,null,null,0.50431216654790423,0.85029993086301292,2.0429446632791324,68.700000000000074,4.5560407569141042]
[null,null,null,null,null,null,null,null,null,0.50805620368708759,0.85532275628480869,2.0509725606656724,68.800000000000068,4.5348837209302175]
[null,null,null,null,null,null,null,null,null,0.51181501724294864,0.86036044316327009,2.0590121082239321,68.900000000000063,4.5137880986937464]
[null,null,null,null,null,null,null,null,null,0.51558863672009481,0.8654130124752949,2.0670633047609828,69.000000000000057,4.4927536231883938]
[null,null,null,null,null,null,null,null,null,0.51937709190986781,0.8704804854084498,2.0751261491841593,69.100000000000051,4.4717800289435488]
[null,null,null,null,null,null,null,null,null,0.52318041289106643,0.87556288336105959,2.0832006405005594,69.200000000000045,4.4508670520231117]
[null,null,null,null,null,null,null,null,null,0.52699863003068537,0.88066022794230969,2.0912867778165443,69.30000000000004,4.4300144300144222]
[null,null,null,null,null,null,null,null,null,0.5308317739846643,0.88577254097234892,2.0993845603372461,69.400000000000034,4.4092219020172845]
[null,null,null,null,null,null,null,null,null,0.53467987569865449,0.89089984448240833,2.1074939873660754,69.500000000000028,4.3884892086330876]
[null,null,null,null,null,null,null,null,null,0.53854296640879862,0.89604216071492426,2.1156150583042383,69.600000000000023,4.367816091954019]
[null,null,null,null,null,null,null,null,null,0.54242107764252534,0.90119951212367244,2.1237477726502574,69.700000000000017,4.3472022955523641]
[null,null,null,null,null,null,null,null,null,0.54631424121935723,0.90637192137390754,2.1318921299994966,69.800000000000011,4.3266475644699121]
[null,null,null,null,null,null,null,null,null,0.55022248925173489,0.91155941134251506,2.1400481300436898,69.900000000000006,4.3061516452074375]
[null,null,null,null,null,null,null,null,null,0.55414585414585404,0.91676200511816941,2.1482157725704769,70,4.2857142857142865]
[null,null,null,null,null,null,null,null,null,0.55808436860251887,0.92197972600150035,2.1563950574629445,70.099999999999994,4.2653352353780321]
[null,null,null,null,null,null,null,null,null,0.5620380656180064,0.92721259750526763,2.1645859846991646,70.199999999999989,4.2450142450142465]
[null,null,null,null,null,null,null,null,null,0.56600697848495107,0.93246064335454659,2.172788554351746,70.299999999999983,4.2247510668563333]
[null,null,null,null,null,null,null,null,null,0.56999114079323909,0.9377238874869197,2.181002766587389,70.399999999999977,4.2045454545454586]
[null,null,null,null,null,null,null,null,null,0.57399058643091871,0.94300235405267507,2.1892286216664374,70.499999999999972,4.1843971631205736]
[null,null,null,null,null,null,null,null,null,0.57800534958512817,0.94829606741501993,2.1974661199424479,70.599999999999966,4.1643059490085061]
[null,null,null,null,null,null,null,null,null,0.58203546474303425,0.95360505215029279,2.2057152618617453,70.69999999999996,4.144271570014153]
[null,null,null,null,null,null,null,null,null,0.58608096669278786,0.95892933304819283,2.2139760479630022,70.799999999999955,4.1242937853107442]
[null,null,null,null,null,null,null,null,null,0.59014189052449495,0.96426893511201206,2.2222484788768093,70.899999999999949,4.1043723554301934]
[null,null,null,null,null,null,null,null,null,0.59421827163120089,0.96962388355887907,2.230532555325254,70.999999999999943,4.0845070422535326]
[null,null,null,null,null,null,null,null,null,0.59831014570989249,0.97499420382000834,2.2388282781215052,71.099999999999937,4.0646976090014189]
[null,null,null,null,null,null,null,null,null,0.60241754876251086,0.98037992154095999,2.2471356481694,71.199999999999932,4.0449438202247325]
[null,null,null,null,null,null,null,null,null,0.6065405170969842,0.98578106258190723,2.2554546664630326,71.299999999999926,4.0252454417952457]
[null,null,null,null,null,null,null,null,null,0.61067908732827203,0.99119765301791118,2.2637853340863527,71.39999999999992,4.0056022408963745]
[null,null,null,null,null,null,null,null,null,0.61483329637942752,0.99662971913920595,2.2721276522127645,71.499999999999915,3.9860139860140027]
[null,null,null,null,null,null,null,null,null,0.61900318148267253,1.0020772874514896,2.2804816221047264,71.599999999999909,3.9664804469273918]
[null,null,null,null,null,null,null,null,null,0.62318878018048962,1.0075403846762243,2.2888472451133639,71.699999999999903,3.947001394700159]
[null,null,null,null,null,null,null,null,null,0.62739013032673085,1.0130190377509487,2.2972245226780776,71.799999999999898,3.9275766016713298]
[null,null,null,null,null,null,null,null,null,0.63160727008773843,1.0185132738295886,2.3056134563261597,71.899999999999892,3.908205841446474]
[null,null,null,null,null,null,null,null,null,0.63584023794348377,1.0240231202827874,2.3140140476724111,71.999999999999886,3.8888888888889106]
[null,null,null,null,null,null,null,null,null,0.64008907268872195,1.0295486046982372,2.3224262984187662,72.099999999999881,3.8696255201109793]
[null,null,null,null,null,null,null,null,null,0.64435381343416098,1.035089754881021,2.3308502103539182,72.199999999999875,3.850415512465398]
[null,null,null,null,null,null,null,null,null,0.64863449960764796,1.0406465988539637,2.3392857853529527,72.299999999999869,3.8312586445366783]
[null,null,null,null,null,null,null,null,null,0.6529311709553699,1.0462191648579882,2.3477330253769786,72.399999999999864,3.8121546961326231]
[null,null,null,null,null,null,null,null,null,0.65724386754307129,1.0518074813524834,2.3561919324727656,72.499999999999858,3.7931034482758896]
[null,null,null,null,null,null,null,null,null,0.66157262975728781,1.0574115770156784,2.3646625087723891,72.599999999999852,3.7741046831956204]
[null,null,null,null,null,null,null,null,null,0.66591749830659552,1.0630314807450254,2.3731447564928723,72.699999999999847,3.7551581843191482]
[null,null,null,null,null,null,null,null,null,0.67027851422287688,1.0686672216575916,2.3816386779358361,72.799999999999841,3.7362637362637656]
[null,null,null,null,null,null,null,null,null,0.67465571886260256,1.0743188290904568,2.3901442754871516,72.899999999999835,3.7174211248285634]
[null,null,null,null,null,null,null,null,null,0.67904915390813114,1.0799863326011239,2.3986615516165948,72.999999999999829,3.698630136986333]
[null,null,null,null,null,null,null,null,null,0.6834588613690219,1.0856697619679321,2.4071905088775098,73.099999999999824,3.6798905608755454]
[null,null,null,null,null,null,null,null,null,0.68788488358336741,1.0913691471904816,2.4157311499064646,73.199999999999818,3.6612021857923835]
[null,null,null,null,null,null,null,null,null,0.69232726321914184,1.0970845184900686,2.4242834774229238,73.299999999999812,3.6425648021828447]
[null,null,null,null,null,null,null,null,null,0.69678604327556493,1.1028159063101226,2.4328474942289153,73.399999999999807,3.6239782016349125]
[null,null,null,null,null,null,null,null,null,0.70126126708448366,1.1085633413166558,2.441423203208704,73.499999999999801,3.6054421768707847]
[null,null,null,null,null,null,null,null,null,0.70575297831177175,1.1143268543987239,2.4500106073284682,73.599999999999795,3.5869565217391681]
[null,null,null,null,null,null,null,null,null,0.71026122095874344,1.120106476668886,2.4586097096359771,73.69999999999979,3.5685210312076379]
[null,null,null,null,null,null,null,null,null,0.71478603936358809,1.125902239463684,2.4672205132602811,73.799999999999784,3.5501355013550526]
[null,null,null,null,null,null,null,null,null,0.71932747820281662,1.1317141743441199,2.4758430214113845,73.899999999999778,3.531799729364046]
[null,null,null,null,null,null,null,null,null,0.72388558249273249,1.1375423130961493,2.4844772373799513,73.999999999999773,3.5135135135135549]
[null,null,null,null,null,null,null,null,null,0.72846039759091341,1.1433866877311787,2.4931231645369833,74.099999999999767,3.4952766531714321]
[null,null,null,null,null,null,null,null,null,0.73305196919771343,1.1492473304865729,2.5017808063335267,74.199999999999761,3.4770889487871059]
[null,null,null,null,null,null,null,null,null,0.7376603433577843,1.15512427382617,2.5104501663003647,74.299999999999756,3.4589502018842975]
[null,null,null,null,null,null,null,null,null,0.74228556646160981,1.1610175504408067,2.5191312480477208,74.39999999999975,3.4408602150538083]
[null,null,null,null,null,null,null,null,null,0.74692768524706277,1.1669271932488461,2.5278240552649662,74.499999999999744,3.4228187919463551]
[null,null,null,null,null,null,null,null,null,0.75158674680097814,1.1728532353967243,2.5365285917203284,74.599999999999739,3.4048257372654618]
[null,null,null,null,null,null,null,null,null,0.75626279856074163,1.1787957102594919,2.5452448612605947,74.699999999999733,3.3868808567604223]
[null,null,null,null,null,null,null,null,null,0.76095588831590077,1.1847546514413789,2.5539728678108387,74.799999999999727,3.3689839572192994]
[null,null,null,null,null,null,null,null,null,{"$f":"IF(D$2>0.2*($N375),(D$2-0.2*($N375))^2/(D$2+0.8*($N375)),0)","v":0.76566606420979266},{"$f":"IF(E$2>0.2*($N375),(E$2-0.2*($N375))^2/(E$2+0.8*($N375)),0)","v":1.1907300927763529},{"$f":"IF(F$2>0.2*($N375),(F$2-0.2*($N375))^2/(F$2+0.8*($N375)),0)","v":2.5627126153741275},74.899999999999721,{"$f":"IF(M375>0,1000/M375-10,1000)","v":3.3511348464619992}]
[null,null,null,null,null,null,null,null,null,0.77039337474118752,1.1967220683286997,2.5714641080312477,{"$f":"M375+0.1","v":74.999999999999716},3.3333333333333837]
[null,null,null,null,null,null,null,null,null,0.77513786876595425,1.2027306123935986,2.5802273499404249,75.09999999999971,3.3155792276964569]
[null,null,null,null,null,null,null,null,null,0.77989959549874344,1.2087557594977199,2.5890023453370548,75.199999999999704,3.2978723404255845]
[null,null,null,null,null,null,null,null,null,0.78467860451468785,1.2147975443998198,2.5977890985334238,75.299999999999699,3.2802124833997883]
[null,null,null,null,null,null,null,null,null,0.78947494575112387,1.220856002091351,2.6065876139184514,75.399999999999693,3.2625994694960756]
[null,null,null,null,null,null,null,null,null,0.79428866950932919,1.2269311677970764,2.6153978959574151,75.499999999999687,3.2450331125828367]
[null,null,null,null,null,null,null,null,null,0.7991198264562831,1.2330230769756956,2.6242199491916947,75.599999999999682,3.227513227513283]
[null,null,null,null,null,null,null,null,null,0.80396846762644325,1.2391317653204759,2.6330537782385064,75.699999999999676,3.2100396301189473]
[null,null,null,null,null,null,null,null,null,0.80883464442354314,1.2452572687598991,2.6418993877906569,75.79999999999967,3.1926121372032235]
[null,null,null,null,null,null,null,null,null,0.8137184086224073,1.2513996234583056,2.650756782616273,75.899999999999665,3.1752305665349727]
[null,null,null,null,null,null,null,null,null,0.8186198123707894,1.2575588658165575,2.6596259675585645,75.999999999999659,3.1578947368421648]
[null,null,null,null,null,null,null,null,null,0.8235389081912271,1.2637350324727075,2.6685069475355685,76.099999999999653,3.1406044678055789]
[null,null,null,null,null,null,null,null,null,0.82847574898291743,1.269928160302668,2.6773997275399029,76.199999999999648,3.1233595800525542]
[null,null,null,null,null,null,null,null,null,0.83343038802361391,1.2761382864209052,2.6863043126385264,76.299999999999642,3.1061598951507818]
[null,null,null,null,null,null,null,null,null,0.83840287897154164,1.2823654481811251,2.6952207079724957,76.399999999999636,3.0890052356021567]
[null,null,null,null,null,null,null,null,null,0.84339327586733426,1.2886096831769818,2.7041489187567245,76.499999999999631,3.071895424836665]
[null,null,null,null,null,null,null,null,null,0.84840163313599104,1.2948710292427843,2.7130889502797557,76.599999999999625,3.0548302872063307]
[null,null,null,null,null,null,null,null,null,0.8534280055888539,1.3011495244542175,2.7220408079035199,76.699999999999619,3.0378096479792038]
[null,null,null,null,null,null,null,null,null,0.85847244842560466,1.3074452071290699,2.7310044970631076,76.799999999999613,3.0208333333333997]
[null,null,null,null,null,null,null,null,null,0.86353501723628767,1.3137581158279739,2.7399800232665443,76.899999999999608,3.0039011703511722]
[null,null,null,null,null,null,null,null,null,0.86861576800334672,1.3200882893551491,2.7489673920945634,76.999999999999602,2.9870129870130544]
[null,null,null,null,null,null,null,null,null,0.87371475710368784,1.3264357667591584,2.7579666092003783,77.099999999999596,2.9701686121920261]
[null,null,null,null,null,null,null,null,null,0.87883204131076298,1.3328005873336697,2.7669776803094686,77.199999999999591,2.9533678756477375]
[null,null,null,null,null,null,null,null,null,0.8839676777966734,1.3391827906182343,2.7760006112193585,77.299999999999585,2.9366106080207679]
[null,null,null,null,null,null,null,null,null,0.8891217241342978,1.3455824163990615,2.7850354077994051,77.399999999999579,2.9198966408269431]
[null,null,null,null,null,null,null,null,null,0.89429423829943744,1.3519995047098154,2.7940820759905769,77.499999999999574,2.9032258064516832]
[null,null,null,null,null,null,null,null,null,0.89948527867298977,1.3584340958324097,2.8031406218052504,77.599999999999568,2.8865979381444014]
[null,null,null,null,null,null,null,null,null,0.90469490404313846,1.3648862302978204,2.8122110513269982,77.699999999999562,2.8700128700129426]
[null,null,null,null,null,null,null,null,null,0.90992317360757058,1.3713559488869025,2.8212933707103889,77.799999999999557,2.8534704370180677]
[null,null,null,null,null,null,null,null,null,0.91517014697571142,1.3778432926312136,2.8303875861807706,77.899999999999551,2.8369704749679823]
[null,null,null,null,null,null,null,null,null,0.9204358841709871,1.384348302813857,2.8394937040340817,77.999999999999545,2.8205128205128958]
[null,null,null,null,null,null,null,null,null,0.92572044563310563,1.3908710209703188,2.8486117306366441,78.09999999999954,2.8040973111396408]
[null,null,null,null,null,null,null,null,null,0.93102389222036619,1.3974114888893281,2.8577416724249733,78.199999999999534,2.7877237851663175]
[null,null,null,null,null,null,null,null,null,0.93634628521198615,1.4039697486137186,2.8668835359055755,78.299999999999528,2.7713920817369857]
[null,null,null,null,null,null,null,null,null,0.94168768631045408,1.4105458424412995,2.8760373276547599,78.399999999999523,2.7551020408164035]
[null,null,null,null,null,null,null,null,null,0.94704815764390815,1.4171398129257418,2.8852030543184473,78.499999999999517,2.7388535031847923]
[null,null,null,null,null,null,null,null,null,0.95242776176853738,1.423751702877468,2.894380722611984,78.599999999999511,2.7226463104326495]
[null,null,null,null,null,null,null,null,null,0.95782656167100466,1.4303815553645518,2.9035703393199555,78.699999999999505,2.7064803049556065]
[null,null,null,null,null,null,null,null,null,0.96324462077089446,1.4370294137136281,2.912771911295998,78.7999999999995,2.6903553299493197]
[null,null,null,null,null,null,null,null,null,0.96868200292319095,1.4436953215108177,2.921985445462624,78.899999999999494,2.6742712294043898]
[null,null,null,null,null,null,null,null,null,0.97413877242077129,1.4503793226026482,2.9312109488110356,78.999999999999488,2.6582278481013475]
[null,null,null,null,null,null,null,null,null,0.97961499399693175,1.4570814610970007,2.9404484284009555,79.099999999999483,2.6422250316056459]
[null,null,null,null,null,null,null,null,null,0.98511073282793538,1.4638017813640551,2.9496978913604468,79.199999999999477,2.6262626262627098]
[null,null,null,null,null,null,null,null,null,0.99062605453558372,1.4705403280372451,2.9589593448857383,79.299999999999471,2.610340479193022]
[null,null,null,null,null,null,null,null,null,0.99616102518981731,1.4772971460142306,2.9682327962410588,79.399999999999466,2.5944584382872389]
[null,null,null,null,null,null,null,null,null,1.0017157113113402,1.4840722804578736,2.9775182527584625,79.49999999999946,2.5786163522013439]
[null,null,null,null,null,null,null,null,null,1.0072901798742697,1.4908657767972233,2.9868157218376683,79.599999999999454,2.5628140703518447]
[null,null,null,null,null,null,null,null,null,1.0128844983088134,1.4976776807285144,2.9961252109458885,79.699999999999449,2.5470514429110036]
[null,null,null,null,null,null,null,null,null,1.018498734503974,1.5045080382161748,3.0054467276176728,79.799999999999443,2.5313283208020927]
[null,null,null,null,null,null,null,null,null,1.0241329568102748,1.5113568954938399,3.014780279454738,79.899999999999437,2.5156445556947062]
[null,null,null,null,null,null,null,null,null,1.0297872340425211,1.5182242990653816,3.0241258741258212,79.999999999999432,2.5000000000000888]
[null,null,null,null,null,null,null,null,null,1.0354616354825807,1.5251102957059415,3.0334835193665137,80.099999999999426,2.4843945068665061]
[null,null,null,null,null,null,null,null,null,1.0411562308821953,1.5320149324629819,3.0428532229791081,80.19999999999942,2.468827930174653]
[null,null,null,null,null,null,null,null,null,1.0468710904658198,1.5389382566573353,3.0522349928324486,80.299999999999415,2.4533001245330919]
[null,null,null,null,null,null,null,null,null,1.0526062849334883,1.5458803158842815,3.0616288368617766,80.399999999999409,2.4378109452737231]
[null,null,null,null,null,null,null,null,null,1.0583618854637078,1.5528411580146131,3.0710347630685817,80.499999999999403,2.4223602484472977]
[null,null,null,null,null,null,null,null,null,1.0641379637163815,1.55982083119573,3.0804527795204577,80.599999999999397,2.4069478908189517]
[null,null,null,null,null,null,null,null,null,1.0699345918357583,1.566819383852734,3.0898828943509531,80.699999999999392,2.3915737298637865]
[null,null,null,null,null,null,null,null,null,1.0757518424534154,1.5738368646895364,3.099325115759429,80.799999999999386,2.3762376237624707]
[null,null,null,null,null,null,null,null,null,1.0815897886912644,1.5808733226899774,3.1087794520109204,80.89999999999938,2.360939431396881]
[null,null,null,null,null,null,null,null,null,1.0874485041645903,1.5879288071189517,3.1182459114359897,80.999999999999375,2.3456790123457747]
[null,null,null,null,null,null,null,null,null,1.0933280629851203,1.5950033675235509,3.1277245024305973,81.099999999999369,2.3304562268804911]
[null,null,null,null,null,null,null,null,null,1.0992285397641208,1.6020970537342085,3.1372152334559589,81.199999999999363,2.3152709359606884]
[null,null,null,null,null,null,null,null,null,{"$f":"IF(D$2>0.2*($N439),(D$2-0.2*($N439))^2/(D$2+0.8*($N439)),0)","v":1.1051500096155258},{"$f":"IF(E$2>0.2*($N439),(E$2-0.2*($N439))^2/(E$2+0.8*($N439)),0)","v":1.6092099158658653},{"$f":"IF(F$2>0.2*($N439),(F$2-0.2*($N439))^2/(F$2+0.8*($N439)),0)","v":3.1467181130384154},81.299999999999358,{"$f":"IF(M439>0,1000/M439-10,1000)","v":2.3001230012301086}]
[null,null,null,null,null,null,null,null,null,1.1110925481590892,1.6163420043191339,3.1562331497692928,{"$f":"M439+0.1","v":81.399999999999352},2.2850122850123835]
[null,null,null,null,null,null,null,null,null,1.1170562315235857,1.6234933697814866,3.1657603523047868,81.499999999999346,2.2699386503068464]
[null,null,null,null,null,null,null,null,null,1.1230411363500168,1.6306640632284404,3.1752997293658134,81.599999999999341,2.2549019607844123]
[null,null,null,null,null,null,null,null,null,1.1290473397948704,1.6378541359247647,3.1848512897378991,81.699999999999335,2.2399020807834535]
[null,null,null,null,null,null,null,null,null,1.1350749195334016,1.6450636394256954,3.1944150422710482,81.799999999999329,2.2249388753057229]
[null,null,null,null,null,null,null,null,null,1.1411239537629423,1.6522926255781565,3.2039909958796158,81.899999999999324,2.2100122100123105]
[null,null,null,null,null,null,null,null,null,1.1471945212062542,1.659541146521996,3.213579159542193,81.999999999999318,2.1951219512196136]
[null,null,null,null,null,null,null,null,null,1.1532867011149028,1.6668092546912354,3.2231795423014806,82.099999999999312,2.1802679658953519]
[null,null,null,null,null,null,null,null,null,1.1594005732726698,1.6740970028153261,3.2327921532641755,82.199999999999307,2.1654501216546045]
[null,null,null,null,null,null,null,null,null,1.1655362179989972,1.6814044439204159,3.2424170016008502,82.299999999999301,2.1506682867558755]
[null,null,null,null,null,null,null,null,null,1.1716937161524656,1.6887316313306353,3.2520540965458364,82.399999999999295,2.1359223300971912]
[null,null,null,null,null,null,null,null,null,1.1778731491343042,1.6960786186693799,3.2617034473971165,82.499999999999289,2.1212121212122259]
[null,null,null,null,null,null,null,null,null,1.1840745988919379,1.7034454598606228,3.2713650635162064,82.599999999999284,2.1065375302664489]
[null,null,null,null,null,null,null,null,null,1.1902981479225629,1.7108322091302235,3.2810389543280469,82.699999999999278,2.0918984280533106]
[null,null,null,null,null,null,null,null,null,1.1965438792767666,1.7182389210072559,3.2907251293208994,82.799999999999272,2.0772946859904451]
[null,null,null,null,null,null,null,null,null,1.2028118765621703,1.7256656503253425,3.3004235980462311,82.899999999999267,2.062726176115909]
[null,null,null,null,null,null,null,null,null,1.2091022239471167,1.7331124522240084,3.310134370118615,82.999999999999261,2.0481927710844445]
[null,null,null,null,null,null,null,null,null,1.2154150061643891,1.7405793821500368,3.3198574552156219,83.099999999999255,2.0336943441637665]
[null,null,null,null,null,null,null,null,null,1.2217503085149666,1.7480664958588479,3.3295928630777247,83.19999999999925,2.0192307692308784]
[null,null,null,null,null,null,null,null,null,1.2281082168718165,1.7555738494158768,3.339340603508191,83.299999999999244,2.0048019207684167]
[null,null,null,null,null,null,null,null,null,1.2344888176837223,1.7631014991979734,3.3491006863729869,83.399999999999238,1.9904076738610215]
[null,null,null,null,null,null,null,null,null,1.2408921979791498,1.7706495018948101,3.3588731216006802,83.499999999999233,1.9760479041917272]
[null,null,null,null,null,null,null,null,null,1.2473184453701482,1.7782179145103023,3.368657919182342,83.599999999999227,1.9617224880383883]
[null,null,null,null,null,null,null,null,null,1.2537676480562934,1.7858067943640408,3.3784550891714522,83.699999999999221,1.9474313022701235]
[null,null,null,null,null,null,null,null,null,1.2602398948286655,1.7934161990927362,3.3882646416838109,83.799999999999216,1.9331742243437873]
[null,null,null,null,null,null,null,null,null,1.2667352750738643,1.8010461866516769,3.3980865868974415,83.89999999999921,1.9189511323004691]
[null,null,null,null,null,null,null,null,null,1.2732538787780661,1.8086968153161975,3.4079209350525019,83.999999999999204,1.904761904762017]
[null,null,null,null,null,null,null,null,null,1.2797957965311206,1.8163681436831614,3.4177676964512007,84.099999999999199,1.8906064209275808]
[null,null,null,null,null,null,null,null,null,1.2863611195306834,1.824060230672454,3.4276268814577042,84.199999999999193,1.8764845605701854]
[null,null,null,null,null,null,null,null,null,1.2929499395863921,1.8317731355284934,3.4374985004980552,84.299999999999187,1.8623962040333293]
[null,null,null,null,null,null,null,null,null,1.2995623491240793,1.839506917821744,3.4473825640600833,84.399999999999181,1.8483412322276038]
[null,null,null,null,null,null,null,null,null,1.3061984411900309,1.8472616374502551,3.4572790826933315,84.499999999999176,1.8343195266273344]
[null,null,null,null,null,null,null,null,null,1.3128583094552819,1.855037354641202,3.4671880670089639,84.59999999999917,1.8203309692672551]
[null,null,null,null,null,null,null,null,null,1.3195420482199536,1.8628341299524471,3.4771095276796968,84.699999999999164,1.8063754427391956]
[null,null,null,null,null,null,null,null,null,1.3262497524176382,1.870652024274108,3.4870434754397128,84.799999999999159,1.7924528301887968]
[null,null,null,null,null,null,null,null,null,1.3329815176198192,1.878491098830148,3.4969899210845883,84.899999999999153,1.7785630153122494]
[null,null,null,null,null,null,null,null,null,1.3397374400403361,1.8863514151799643,3.5069488754712155,84.999999999999147,1.7647058823530593]
[null,null,null,null,null,null,null,null,null,1.3465176165398969,1.8942330352200074,3.5169203495177284,85.099999999999142,1.7508813160988268]
[null,null,null,null,null,null,null,null,null,1.3533221446306307,1.9021360211854039,3.5269043542034342,85.199999999999136,1.737089201878053]
[null,null,null,null,null,null,null,null,null,1.3601511224806806,1.9100604356515882,3.5369009005687357,85.29999999999913,1.7233294255569778]
[null,null,null,null,null,null,null,null,null,1.3670046489188532,1.9180063415359632,3.546909999715067,85.399999999999125,1.7096018735364193]
[null,null,null,null,null,null,null,null,null,1.3738828234392975,1.9259738020995543,3.5569316628048218,85.499999999999119,1.695906432748659]
[null,null,null,null,null,null,null,null,null,1.3807857462062454,1.9339628809487004,3.566965901061288,85.599999999999113,1.682242990654327]
[null,null,null,null,null,null,null,null,null,1.3877135180587843,1.9419736420367362,3.5770127257685829,85.699999999999108,1.6686114352393275]
[null,null,null,null,null,null,null,null,null,1.3946662405156833,1.950006149665704,3.5870721482715835,85.799999999999102,1.6550116550117764]
[null,null,null,null,null,null,null,null,null,1.4016440157802679,1.9580604684880709,3.5971441799758694,85.899999999999096,1.6414435389989581]
[null,null,null,null,null,null,null,null,null,1.4086469467453382,1.9661366635084669,3.6072288323476598,85.999999999999091,1.6279069767443097]
[null,null,null,null,null,null,null,null,null,1.4156751369981375,1.9742348000854331,3.6173261169137532,86.099999999999085,1.6144018583044204]
[null,null,null,null,null,null,null,null,null,1.4227286908253638,1.9823549439331805,3.627436045261462,86.199999999999079,1.6009280742460632]
[null,null,null,null,null,null,null,null,null,1.4298077132182414,1.9904971611233719,3.6375586290385651,86.299999999999073,1.5874855156432304]
[null,null,null,null,null,null,null,null,null,1.436912309877632,1.9986615180869145,3.6476938799532483,86.399999999999068,1.5740740740741987]
[null,null,null,null,null,null,null,null,null,1.4440425872191982,2.0068480816157614,3.6578418097740419,86.499999999999062,1.5606936416186219]
[null,null,null,null,null,null,null,null,null,1.4511986523786202,2.0150569188647389,3.6680024303297736,86.599999999999056,1.5473441108546293]
[null,null,null,null,null,null,null,null,null,1.4583806132168637,2.0232880973533796,3.6781757535095179,86.699999999999051,1.5340253748559505]
[null,null,null,null,null,null,null,null,null,1.4655885783254914,2.0315416849677739,3.6883617912625386,86.799999999999045,1.5207373271890674]
[null,null,null,null,null,null,null,null,null,1.4728226570320424,2.0398177499624364,3.6985605555982435,86.899999999999039,1.5074798619103689]
[null,null,null,null,null,null,null,null,null,1.4800829594054441,2.0481163609621871,3.708772058586133,86.999999999999034,1.4942528735633456]
[null,null,null,null,null,null,null,null,null,1.4873695962614959,2.0564375869640479,3.7189963123557521,87.099999999999028,1.4810562571757888]
[null,null,null,null,null,null,null,null,null,1.4946826791683967,2.0647814973391538,3.7292333290966497,87.199999999999022,1.4678899082570087]
[null,null,null,null,null,null,null,null,null,1.5020223204523253,2.0731481618346823,3.7394831210583237,87.299999999999017,1.4547537227950897]
[null,null,null,null,null,null,null,null,null,1.5093886332030868,2.0815376505757963,3.7497457005501893,87.399999999999011,1.4416475972541338]
[null,null,null,null,null,null,null,null,null,1.5167817312797989,2.0899500340675972,3.7600210799415232,87.499999999999005,1.4285714285715585]
[null,null,null,null,null,null,null,null,null,1.5242017293166488,2.0983853831971095,3.7703092716614344,87.599999999999,1.4155251141553808]
[null,null,null,null,null,null,null,null,null,{"$f":"IF(D$2>0.2*($N503),(D$2-0.2*($N503))^2/(D$2+0.8*($N503)),0)","v":1.5316487427286956},{"$f":"IF(E$2>0.2*($N503),(E$2-0.2*($N503))^2/(E$2+0.8*($N503)),0)","v":2.1068437692352608},{"$f":"IF(F$2>0.2*($N503),(F$2-0.2*($N503))^2/(F$2+0.8*($N503)),0)","v":3.7806102881988162},87.699999999998994,{"$f":"IF(M503>0,1000/M503-10,1000)","v":1.4025085518815441}]
[null,null,null,null,null,null,null,null,null,1.5391228877177412,2.1153252638388969,3.7909241421023108,{"$f":"M503+0.1","v":87.799999999998988},1.3895216400912478]
[null,null,null,null,null,null,null,null,null,1.546624281278248,2.123829939052797,3.8012508459802703,87.899999999998983,1.3765642775883009]
[null,null,null,null,null,null,null,null,null,1.5541530412033235,2.1323578673117205,3.8115904125007214,87.999999999998977,1.3636363636364965]
[null,null,null,null,null,null,null,null,null,1.5617092860907575,2.1409091214424536,3.8219428543913279,88.099999999998971,1.3507377979570006]
[null,null,null,null,null,null,null,null,null,1.5692931353491273,2.1494837746658892,3.8323081844393605,88.199999999998965,1.3378684807257564]
[null,null,null,null,null,null,null,null,null,1.5769047092039545,2.1580819005991101,3.8426864154916571,88.29999999999896,1.3250283125709146]
[null,null,null,null,null,null,null,null,null,1.5845441287039308,2.1667035732574962,3.8530775604545968,88.399999999998954,1.3122171945702696]
[null,null,null,null,null,null,null,null,null,1.5922115157272003,2.1753488670568459,3.8634816322940693,88.499999999998948,1.2994350282487215]
[null,null,null,null,null,null,null,null,null,1.5999069929877068,2.1840178568155189,3.8738986440354437,88.599999999998943,1.2866817155757548]
[null,null,null,null,null,null,null,null,null,1.6076306840416041,2.1927106177565858,3.8843286087635369,88.699999999998937,1.273957158962931]
[null,null,null,null,null,null,null,null,null,1.6153827132937302,2.2014272255100087,3.8947715396225937,88.799999999998931,1.2612612612613976]
[null,null,null,null,null,null,null,null,null,1.6231632060041474,2.2101677561148301,3.9052274498162585,88.899999999998926,1.2485939257594154]
[null,null,null,null,null,null,null,null,null,1.6309722882947408,2.2189322860213765,3.9156963526075406,88.99999999999892,1.2359550561799111]
[null,null,null,null,null,null,null,null,null,1.6388100871558946,2.2277208920934926,3.9261782613188054,89.099999999998914,1.2233445566780272]
[null,null,null,null,null,null,null,null,null,1.6466767304532279,2.236533651610781,3.9366731893317453,89.199999999998909,1.2107623318387031]
[null,null,null,null,null,null,null,null,null,1.6545723469343976,2.2453706422708688,3.9471811500873568,89.299999999998903,1.1982082866742694]
[null,null,null,null,null,null,null,null,null,1.6624970662359688,2.2542319421916766,3.9577021570859183,89.399999999998897,1.1856823266220626]
[null,null,null,null,null,null,null,null,null,1.6704510188903645,2.2631176299137317,3.9682362238869797,89.499999999998892,1.1731843575420378]
[null,null,null,null,null,null,null,null,null,1.6784343363328689,2.2720277844024754,3.9787833641093333,89.599999999998886,1.160714285714425]
[null,null,null,null,null,null,null,null,null,1.6864471509087162,2.2809624850506038,3.9893435914310063,89.69999999999888,1.1482720178373746]
[null,null,null,null,null,null,null,null,null,1.69448959588024,2.2899218116804159,3.9999169195892352,89.799999999998875,1.1358574610246386]
[null,null,null,null,null,null,null,null,null,1.7025618054341023,2.2989058445461912,4.0105033623804625,89.899999999998869,1.1234705228032542]
[null,null,null,null,null,null,null,null,null,1.7106639146885905,2.3079146643365802,4.0211029336603117,89.999999999998863,1.111111111111251]
[null,null,null,null,null,null,null,null,null,1.7187960597009926,2.3169483521770169,4.0317156473435807,90.099999999998857,1.0987791342953681]
[null,null,null,null,null,null,null,null,null,1.7269583774750439,2.3260069896321469,4.0423415174042319,90.199999999998852,1.0864745011087891]
[null,null,null,null,null,null,null,null,null,1.7351510059684501,2.3350906587082783,4.0529805578753768,90.299999999998846,1.0741971207088898]
[null,null,null,null,null,null,null,null,null,1.7433740841004866,2.3441994418558494,4.0636327828492655,90.39999999999884,1.0619469026550092]
[null,null,null,null,null,null,null,null,null,1.7516277517596763,2.3533334219719197,4.0742982064772884,90.499999999998835,1.0497237569062197]
[null,null,null,null,null,null,null,null,null,1.7599121498115446,2.3624926824026788,4.0849768429699536,90.599999999998829,1.037527593819128]
[null,null,null,null,null,null,null,null,null,1.7682274201064554,2.3716773069459753,4.0956687065968982,90.699999999998823,1.0253583241456781]
[null,null,null,null,null,null,null,null,null,1.7765737054875204,2.380887379853863,4.1063738116868649,90.799999999998818,1.0132158590309803]
[null,null,null,null,null,null,null,null,null,1.7849511497986001,2.3901229858351747,4.1170921726277117,90.899999999998812,1.0011001100111443]
[null,null,null,null,null,null,null,null,null,1.7933598978923757,2.3993842100581082,4.127823803866403,90.999999999998806,0.98901098901113293]
[null,null,null,null,null,null,null,null,null,1.8018000956385125,2.4086711381528412,4.1385687199090055,91.099999999998801,0.97694840834262564]
[null,null,null,null,null,null,null,null,null,1.8102718899319032,2.4179838562141627,4.1493269353206941,91.199999999998795,0.96491228070189905]
[null,null,null,null,null,null,null,null,null,1.8187754287009927,2.4273224508041205,4.1600984647257446,91.299999999998789,0.95290251916772384]
[null,null,null,null,null,null,null,null,null,1.827310860916193,2.4366870089546984,4.170883322807537,91.399999999998784,0.94091903719927039]
[null,null,null,null,null,null,null,null,null,1.8358783365983886,2.4460776181705159,4.1816815243085621,91.499999999998778,0.92896174863402514]
[null,null,null,null,null,null,null,null,null,1.8444780068275166,2.4554943664315361,4.1924930840304162,91.599999999998772,0.91703056768573532]
[null,null,null,null,null,null,null,null,null,1.8531100237512483,2.4649373421958116,4.2033180168338093,91.699999999998766,0.90512540894235016]
[null,null,null,null,null,null,null,null,null,1.8617745405937591,2.4744066344022451,4.2141563376385784,91.799999999998761,0.89324618736398165]
[null,null,null,null,null,null,null,null,null,1.8704717116645764,2.4839023324733627,4.2250080614236731,91.899999999998755,0.88139281828088656]
[null,null,null,null,null,null,null,null,null,1.8792016923675354,2.4934245263181296,4.2358732032271833,91.999999999998749,0.86956521739145209]
[null,null,null,null,null,null,null,null,null,1.8879646392098219,2.502973306334773,4.2467517781463364,92.099999999998744,0.85776330076019214]
[null,null,null,null,null,null,null,null,null,1.8967607098111072,2.5125487634136334,4.2576438013375109,92.199999999998738,0.84598698481576662]
[null,null,null,null,null,null,null,null,null,1.9055900629127751,2.5221509889400342,4.2685492880162403,92.299999999998732,0.83423618634901153]
[null,null,null,null,null,null,null,null,null,1.9144528583872553,2.5317800747971786,4.2794682534572317,92.399999999998727,0.82251082251097252]
[null,null,null,null,null,null,null,null,null,1.9233492572474489,2.5414361133690759,4.2904007129943755,92.499999999998721,0.81081081081095974]
[null,null,null,null,null,null,null,null,null,1.9322794216562427,2.5511191975434691,4.3013466820207498,92.599999999998715,0.79913606911462054]
[null,null,null,null,null,null,null,null,null,1.9412435149361451,2.5608294207148172,4.3123061759886507,92.69999999999871,0.787486515642005]
[null,null,null,null,null,null,null,null,null,1.950241701579001,2.5705668767872729,4.3232792104095923,92.799999999998704,0.77586206896566701]
[null,null,null,null,null,null,null,null,null,1.9592741472558215,2.5803316601777042,4.3342658008543324,92.899999999998698,0.76426264800876176]
[null,null,null,null,null,null,null,null,null,1.9683410188267152,2.5901238658187284,4.3452659629528814,92.999999999998693,0.75268817204316107]
[null,null,null,null,null,null,null,null,null,1.9774424843509169,2.5999435891617741,4.3562797123945272,93.099999999998687,0.74113856068758466]
[null,null,null,null,null,null,null,null,null,1.9865787130969357,2.6097909261801742,4.3673070649278527,93.199999999998681,0.72961373390573137]
[null,null,null,null,null,null,null,null,null,1.9957498755527954,2.6196659733722707,4.3783480363607481,93.299999999998676,0.71811361200443891]
[null,null,null,null,null,null,null,null,null,2.0049561434363907,2.6295688277645537,4.3894026425604418,93.39999999999867,0.70663811563184353]
[null,null,null,null,null,null,null,null,null,2.0141976897059561,2.6394995869148263,4.4004708994535164,93.499999999998664,0.69518716577555395]
[null,null,null,null,null,null,null,null,null,2.0234746885706416,2.6494583489153918,4.4115528230259313,93.599999999998658,0.68376068376083765]
[null,null,null,null,null,null,null,null,null,2.032787315501198,2.6594452123962649,4.4226484293230515,93.699999999998653,0.67235859124881969]
[null,null,null,null,null,null,null,null,null,2.0421357472407822,2.6694602765284121,4.4337577344496619,93.799999999998647,0.66098081023469568]
[null,null,null,null,null,null,null,null,null,2.0515201618158732,2.6795036410270163,4.4448807545700033,93.899999999998641,0.64962726304594831]
[null,null,null,null,null,null,null,null,null,2.06094073854731,2.6895754061547725,4.4560175059077922,93.999999999998636,0.63829787234057989]
[null,null,null,null,null,null,null,null,null,{"$f":"IF(D$2>0.2*($N567),(D$2-0.2*($N567))^2/(D$2+0.8*($N567)),0)","v":2.0703976580614372},{"$f":"IF(E$2>0.2*($N567),(E$2-0.2*($N567))^2/(E$2+0.8*($N567)),0)","v":2.6996756727252},{"$f":"IF(F$2>0.2*($N567),(F$2-0.2*($N567))^2/(F$2+0.8*($N567)),0)","v":4.4671680047462505},94.09999999999863,{"$f":"IF(M567>0,1000/M567-10,1000)","v":0.62699256110536261}]
[null,null,null,null,null,null,null,null,null,2.0798911023013824,2.7098045421059935,4.4783322674281321,{"$f":"M567+0.1","v":94.199999999998624},0.61571125265408355]
[null,null,null,null,null,null,null,null,null,2.0894212545384465,2.7199621162223919,4.489510310355759,94.299999999998619,0.60445387062581801]
[null,null,null,null,null,null,null,null,null,2.0989882993836164,2.7301484975605779,4.5007021499910351,94.399999999998613,0.59322033898320647]
[null,null,null,null,null,null,null,null,null,2.1085924227992079,2.7403637891711061,4.5119078028554966,94.499999999998607,0.58201058201073863]
[null,null,null,null,null,null,null,null,null,2.1182338121106268,2.7506080946723608,4.5231272855303315,94.599999999998602,0.57082452431305342]
[null,null,null,null,null,null,null,null,null,2.1279126560182613,2.7608815182540343,4.5343606146564186,94.699999999998596,0.55966209081324969]
[null,null,null,null,null,null,null,null,null,2.1376291446094959,2.7711841646806343,4.5456078069343526,94.79999999999859,0.54852320675121113]
[null,null,null,null,null,null,null,null,null,2.1473834693708707,2.7815161392950345,4.5568688791244893,94.899999999998585,0.53740779768192759]
[null,null,null,null,null,null,null,null,null,2.1571758232003582,2.791877548022037,4.5681438480469776,94.999999999998579,0.52631578947384128]
[null,null,null,null,null,null,null,null,null,2.1670064004197727,2.8022684973719647,4.5794327305817895,95.099999999998573,0.51524710830720366]
[null,null,null,null,null,null,null,null,null,2.1768753967873304,2.8126890944443002,4.59073554366877,95.199999999998568,0.50420168067242699]
[null,null,null,null,null,null,null,null,null,2.186783009510326,2.8231394469313269,4.6020523043076604,95.299999999998562,0.49317943336846959]
[null,null,null,null,null,null,null,null,null,2.1967294372579644,2.8336196631218269,4.6133830295581522,95.399999999998556,0.48218029350120695]
[null,null,null,null,null,null,null,null,null,2.2067148801743213,2.8441298519047904,4.6247277365399144,95.49999999999855,0.47120418848183476]
[null,null,null,null,null,null,null,null,null,2.2167395398914547,2.8546701227731663,4.6360864424326449,95.599999999998545,0.46025104602526312]
[null,null,null,null,null,null,null,null,null,2.2268036195426495,2.8652405858276322,4.6474591644761034,95.699999999998539,0.44932079414853909]
[null,null,null,null,null,null,null,null,null,2.2369073237758186,2.87584135178041,4.6588459199701617,95.799999999998533,0.43841336116926222]
[null,null,null,null,null,null,null,null,null,2.2470508587670479,2.8864725319591003,4.6702467262748444,95.899999999998528,0.42752867570401776]
[null,null,null,null,null,null,null,null,null,2.2572344322342812,2.8971342383105507,4.6816616008103678,95.999999999998522,0.41666666666682772]
[null,null,null,null,null,null,null,null,null,2.2674582534511742,2.9078265834047627,4.6930905610571978,96.099999999998516,0.40582726326759122]
[null,null,null,null,null,null,null,null,null,2.2777225332610849,2.9185496804388205,4.7045336245560838,96.199999999998511,0.39501039501055679]
[null,null,null,null,null,null,null,null,null,2.2880274840912285,2.9293036432408646,4.7159908089081162,96.299999999998505,0.38421599169278764]
[null,null,null,null,null,null,null,null,null,2.2983733199669794,2.9400885862740727,4.7274621317747565,96.399999999998499,0.37344398340265172]
[null,null,null,null,null,null,null,null,null,2.3087602565263574,2.9509046246407182,4.7389476108779176,96.499999999998494,0.36269430051829588]
[null,null,null,null,null,null,null,null,null,2.319188511034632,2.9617518740862079,4.7504472639999795,96.599999999998488,0.35196687370616608]
[null,null,null,null,null,null,null,null,null,2.3296583023991357,2.972630451003198,4.7619611089838605,96.699999999998482,0.34126163391950115]
[null,null,null,null,null,null,null,null,null,2.3401698511842133,2.9835404724357195,4.7734891637330685,96.799999999998477,0.33057851239685654]
[null,null,null,null,null,null,null,null,null,2.3507233796263409,2.9944820560833412,4.7850314462117405,96.899999999998471,0.3199174406606371]
[null,null,null,null,null,null,null,null,null,2.3613191116494305,3.0054553203053733,4.7965879744447069,96.999999999998465,0.30927835051562624]
[null,null,null,null,null,null,null,null,null,2.37195727288029,3.0164603841251019,4.8081587665175434,97.09999999999846,0.29866117404753645]
[null,null,null,null,null,null,null,null,null,2.3826380906642632,3.0274973672340568,4.8197438405766224,97.199999999998454,0.28806584362156329]
[null,null,null,null,null,null,null,null,null,2.3933617940810521,3.0385663899963218,4.8313432148291788,97.299999999998448,0.27749229188094482]
[null,null,null,null,null,null,null,null,null,2.4041286139607005,3.049667573452866,4.842956907543349,97.399999999998442,0.26694045174554404]
[null,null,null,null,null,null,null,null,null,2.414938782899779,3.0608010393259284,4.854584937048247,97.499999999998437,0.2564102564104207]
[null,null,null,null,null,null,null,null,null,2.4257925352777394,3.0719669100234284,4.8662273217340095,97.599999999998431,0.24590163934442621]
[null,null,null,null,null,null,null,null,null,2.4366901072734577,3.0831653086434123,4.8778840800518637,97.699999999998425,0.23541453428880388]
[null,null,null,null,null,null,null,null,null,2.4476317368819718,3.0943963589785466,4.8895552305141843,97.79999999999842,0.2249488752557891]
[null,null,null,null,null,null,null,null,null,2.4586176639313968,3.1056601855206329,4.9012407916945513,97.899999999998414,0.21450459652723453]
[null,null,null,null,null,null,null,null,null,2.4696481301000479,3.1169569134651778,4.9129407822278202,97.999999999998408,0.20408163265322621]
[null,null,null,null,null,null,null,null,null,2.4807233789337411,3.1282866687159836,4.9246552208101706,98.099999999998403,0.19367991845072652]
[null,null,null,null,null,null,null,null,null,2.4918436558633172,3.139649577889795,4.9363841261991883,98.199999999998397,0.18329938900220277]
[null,null,null,null,null,null,null,null,null,2.503009208222339,3.1510457683209698,4.9481275172139139,98.299999999998391,0.17293997965428609]
[null,null,null,null,null,null,null,null,null,2.5142202852650102,3.1624753680661932,4.9598854127349146,98.399999999998386,0.16260162601642669]
[null,null,null,null,null,null,null,null,null,2.5254771381842951,3.1739385059092391,4.9716578317043503,98.49999999999838,0.15228426395955807]
[null,null,null,null,null,null,null,null,null,2.5367800201302471,3.1854353113657585,4.9834447931260417,98.599999999998374,0.14198782961477185]
[null,null,null,null,null,null,null,null,null,2.5481291862285458,3.1969659146881177,4.9952463160655345,98.699999999998369,0.13171225937200148]
[null,null,null,null,null,null,null,null,null,2.5595248935992556,3.2085304468702724,5.007062419650171,98.799999999998363,0.12145748987870952]
[null,null,null,null,null,null,null,null,null,2.5709674013757926,3.220129039652682,5.0188931230691534,98.899999999998357,0.11122345803859091]
[null,null,null,null,null,null,null,null,null,2.5824569707241261,3.2317618255272751,5.0307384455736281,98.999999999998352,0.10101010101026908]
[null,null,null,null,null,null,null,null,null,2.5939938648621821,3.2434289377424377,5.0425984064767384,99.099999999998346,9.0817356206020605E-2]
[null,null,null,null,null,null,null,null,null,2.6055783490794933,3.2551305103080632,5.0544730251537109,99.19999999999834,8.0645161290490819E-2]
[null,null,null,null,null,null,null,null,null,2.617210690757068,3.2668666780006328,5.0663623210419209,99.299999999998334,7.0493454179423765E-2]
[null,null,null,null,null,null,null,null,null,2.6288911593874937,3.2786375763683422,5.0782663136409711,99.399999999998329,6.0362173038399192E-2]
[null,null,null,null,null,null,null,null,null,2.6406200265952777,3.290443341736276,5.0901850225127623,99.499999999998323,5.0251256281576673E-2]
[null,null,null,null,null,null,null,null,null,2.6523975661574211,3.3022841112116139,5.1021184672815663,99.599999999998317,4.0160642570450378E-2]
[null,null,null,null,null,null,null,null,null,2.6642240540242392,3.3141600226888919,5.1140666676341091,99.699999999998312,3.00902708126074E-2]
[null,null,null,null,null,null,null,null,null,2.6760997683404337,3.3260712148553111,5.1260296433196428,99.799999999998306,2.0040080160491414E-2]
[null,null,null,null,null,null,null,null,null,2.6880249894664008,3.3380178271960776,5.1380074141500254,99.8999999999983,1.0010010010180537E-2]
[null,null,null,null,null,null,null,null,null,2.6999999999997955,3.3499999999997954,5.1499999999997961,99.999999999998295,1.7053025658242404E-13]

{"sheet":"Print Summary","index":8,"n_rows":48,"n_cols":8,"rows_kept":48,"cut":false,"hidden":false,"merged":[]}
[]
[null,"West Virginia MS4 Stormwater Compliance Spreadsheet v2.0; April 2013"]
[]
[null,"Site Data Summary"]
[]
[null,"Site Land Cover Summary"]
[]
[null,null,"A Soils","B Soils","C Soils","D Soils","Total","% of Total"]
[null,"Forest (acres)",0,0,0,0,0,0]
[null,"Turf (acres)",0,0,0,0,0,0]
[null,"Impervious (acres)",0,0,0,0,0,0]
[null,null,null,null,null,null,0,0]
[null,null,""]
[]
[null,"Site Rv",0]
[null,"Post Development Treatment Volume (ft3)",0]
[]
[null,"Total Runoff Volume Reduction (ft3)",0]
[]
[]
[null,"Drainage Area Summary"]
[]
[null,null,"D.A. A","D.A. B","D.A. C","D.A. D","D.A. E","Total"]
[null,"Forest (acres)",0,0,0,0,0,0]
[null,"Turf (acres)",0,0,0,0,0,0]
[null,"Impervious (acres)",0,0,0,0,0,0]
[null,null,null,null,null,null,null,0]
[]
[]
[]
[]
[]
[]
[]
[]
[]
[]
[]
[]
[null,"Channel and Flood Protection"]
[]
[null,null,"Weighted CN","1-year storm Adjusted CN","2-year storm Adjusted CN","10-year storm Adjusted CN"]
[null,"Target Rainfall Event (in)",null,2.7,3.35,5.15]
[null,"D.A. A CN",0,0,0,0]
[null,"D.A. B CN",0,0,0,0]
[null,"D.A. C CN",0,0,0,0]
[null,"D.A. D CN",0,0,0,0]
[null,"D.A. E CN",0,0,0,0]

{"sheet":"Summary_BU","index":9,"n_rows":233,"n_cols":9,"rows_kept":233,"cut":false,"hidden":true,"merged":[]}
[null,null,null,null,null,null,null,null,"wv"]
[null,{"$f":"'Site Data'!A1","v":"West Virginia MS4 Stormwater Compliance Spreadsheet v2.0; April 2013"}]
[]
[null,"Site Data Summary"]
[]
[null,"Site Land Cover Summary"]
[]
[null,null,"A Soils","B Soils","C Soils","D Soils","Total","% of Total"]
[null,"Forest (acres)",{"$f":"'Site Data'!B52","v":0},{"$f":"'Site Data'!C52","v":0},{"$f":"'Site Data'!D52","v":0},{"$f":"'Site Data'!E52","v":0},{"$f":"'Site Data'!F52","v":0},{"$f":"IF(G$12>0,G9/G$12*100,0)","v":0}]
[null,"Turf (acres)",{"$f":"'Site Data'!B53","v":0},{"$f":"'Site Data'!C53","v":0},{"$f":"'Site Data'!D53","v":0},{"$f":"'Site Data'!E53","v":0},{"$f":"'Site Data'!F53","v":0},{"$f":"IF(G$12>0,G10/G$12*100,0)","v":0}]
[null,"Impervious (acres)",{"$f":"'Site Data'!B54","v":0},{"$f":"'Site Data'!C54","v":0},{"$f":"'Site Data'!D54","v":0},{"$f":"'Site Data'!E54","v":0},{"$f":"'Site Data'!F54","v":0},{"$f":"IF(G$12>0,G11/G$12*100,0)","v":0}]
[null,null,null,null,null,null,{"$f":"'Site Data'!F55","v":0},{"$f":"SUM(H9:H11)","v":0}]
[null,null,{"$f":"IF(('D.A. A'!F8+'D.A. B'!F8+'D.A. C'!F8+'D.A. D'!F8+'D.A. E'!F8) >Summary_BU!G12,\"Sum of Drainage Areas is greater than Total Site Area\",\"\")","v":""}]
[]
[null,"Site Rv",{"$f":"'Site Data'!B75","v":0}]
[null,"Post Development Treatment Volume (ft3)",{"$f":"'Site Data'!B88","v":0}]
[]
[null,"Total Runoff Volume Reduction (ft3)",{"$f":"'Runoff Reduction Summary'!B7","v":0}]
[]
[]
[null,"Drainage Area Summary"]
[]
[null,null,"D.A. A","D.A. B","D.A. C","D.A. D","D.A. E","Total"]
[null,"Forest (acres)",{"$f":"'Site Data'!F17","v":0},{"$f":"'Site Data'!F24","v":0},{"$f":"'Site Data'!F31","v":0},{"$f":"'Site Data'!F38","v":0},{"$f":"'Site Data'!F45","v":0},{"$f":"SUM(C24:G24)","v":0}]
[null,"Turf (acres)",{"$f":"'Site Data'!F18","v":0},{"$f":"'Site Data'!F25","v":0},{"$f":"'Site Data'!F32","v":0},{"$f":"'Site Data'!F39","v":0},{"$f":"'Site Data'!F46","v":0},{"$f":"SUM(C25:G25)","v":0}]
[null,"Impervious (acres)",{"$f":"'Site Data'!F19","v":0},{"$f":"'Site Data'!F26","v":0},{"$f":"'Site Data'!F33","v":0},{"$f":"'Site Data'!F40","v":0},{"$f":"'Site Data'!F47","v":0},{"$f":"SUM(C26:G26)","v":0}]
[null,null,null,null,null,null,null,{"$f":" SUM(H24:H26)","v":0}]
[]
[]
[null,"Drainage Area A Summary",null,null,null,null,null,null,{"$f":"IF(SUM($C$24:$C$26)<>0,1,\"\")","v":""}]
[null,null,null,null,null,null,null,null,{"$f":"IF(SUM($C$24:$C$26)<>0,1,\"\")","v":""}]
[null,"Land Cover Summary",null,null,null,null,null,null,""]
[null,null,null,null,null,null,null,null,""]
[null,null,"A Soils","B Soils","C Soils","D Soils","Total","% of Total",""]
[null,"Forest (acres)",{"$f":"'Site Data'!B17","v":0},{"$f":"'Site Data'!C17","v":0},{"$f":"'Site Data'!D17","v":0},{"$f":"'Site Data'!E17","v":0},{"$f":"'Site Data'!F17","v":0},{"$f":"IF(G$38>0,G35/G$38*100,0)","v":0},""]
[null,"Turf (acres)",{"$f":"'Site Data'!B18","v":0},{"$f":"'Site Data'!C18","v":0},{"$f":"'Site Data'!D18","v":0},{"$f":"'Site Data'!E18","v":0},{"$f":"'Site Data'!F18","v":0},{"$f":"IF(G$38>0,G36/G$38*100,0)","v":0},""]
[null,"Impervious (acres)",{"$f":"'Site Data'!B19","v":0},{"$f":"'Site Data'!C19","v":0},{"$f":"'Site Data'!D19","v":0},{"$f":"'Site Data'!E19","v":0},{"$f":"'Site Data'!F19","v":0},{"$f":"IF(G$38>0,G37/G$38*100,0)","v":0},""]
[null,null,null,null,null,null,{"$f":"SUM(G35:G37)","v":0},null,""]
[null,null,null,null,null,null,null,null,""]
[null,"BMP Selections",null,null,null,null,null,null,""]
[null,null,null,null,null,null,null,null,""]
[null,{"$f":"IF(SUM(I43:I63)>0,\"Practice\",\"No Practices in this Drainage Area\")","v":"No Practices in this Drainage Area"},"Credit Area (acres)","Runoff Reduction (ft3)","Downstream Practice",null,null,null,""]
[null,"Vegetated Roof",{"$f":"SUMIFS('D.A. A'!$B$19:$B$47,'D.A. A'!$A$19:$A$47,B43,'D.A. A'!$B$19:$B$47,\">0\")+SUMIFS('D.A. A'!$C$19:$C$47,'D.A. A'!$A$19:$A$47,B43,'D.A. A'!$C$19:$C$47,\">0\")","v":0},{"$f":"SUMIFS('D.A. A'!$K$19:$K$47,'D.A. A'!$A$19:$A$47,B43,'D.A. A'!$K$19:$K$47,\">0\")","v":0},{"$f":"IF(OFFSET(INDEX('D.A. A'!$A$19:$A$47,MATCH(B43,'D.A. A'!$A$19:$A$47,0),1),0,12)=0,\"\",IF(LEN(OFFSET(INDEX('D.A. A'!$A$19:$A$47,MATCH(B43,'D.A. A'!$A$19:$A$47,0),1),0,12))>27,LEFT(OFFSET(INDEX('D.A. A'!$A$19:$A$47,MATCH(B43,'D.A. A'!$A$19:$A$47,0),1),0,12),27)&\"…\",OFFSET(INDEX('D.A. A'!$A$19:$A$47,MATCH(B43,'D.A. A'!$A$19:$A$47,0),1),0,12)))","v":""},null,null,null,{"$f":"IF(AND(D43>0,SUM($C$24:$C$26)>0),1,\"\")","v":""}]
[null,"Simple Disconnection to A/B Soils or Soil-Amended Filter Path in C/D Soils (4.2.2, Appendix D)",{"$f":"SUMIFS('D.A. A'!$B$19:$B$47,'D.A. A'!$A$19:$A$47,B44,'D.A. A'!$B$19:$B$47,\">0\")+SUMIFS('D.A. A'!$C$19:$C$47,'D.A. A'!$A$19:$A$47,B44,'D.A. A'!$C$19:$C$47,\">0\")","v":0},{"$f":"SUMIFS('D.A. A'!$K$19:$K$47,'D.A. A'!$A$19:$A$47,B44,'D.A. A'!$K$19:$K$47,\">0\")","v":0},{"$f":"IF(OFFSET(INDEX('D.A. A'!$A$19:$A$47,MATCH(B44,'D.A. A'!$A$19:$A$47,0),1),0,12)=0,\"\",IF(LEN(OFFSET(INDEX('D.A. A'!$A$19:$A$47,MATCH(B44,'D.A. A'!$A$19:$A$47,0),1),0,12))>27,LEFT(OFFSET(INDEX('D.A. A'!$A$19:$A$47,MATCH(B44,'D.A. A'!$A$19:$A$47,0),1),0,12),27)&\"…\",OFFSET(INDEX('D.A. A'!$A$19:$A$47,MATCH(B44,'D.A. A'!$A$19:$A$47,0),1),0,12)))","v":""},null,null,null,{"$f":"IF(AND(D44>0,SUM($C$24:$C$26)>0),1,\"\")","v":""}]
[null,"Simple Disconnection to C/D Soils (4.2.2)",{"$f":"SUMIFS('D.A. A'!$B$19:$B$47,'D.A. A'!$A$19:$A$47,B45,'D.A. A'!$B$19:$B$47,\">0\")+SUMIFS('D.A. A'!$C$19:$C$47,'D.A. A'!$A$19:$A$47,B45,'D.A. A'!$C$19:$C$47,\">0\")","v":0},{"$f":"SUMIFS('D.A. A'!$K$19:$K$47,'D.A. A'!$A$19:$A$47,B45,'D.A. A'!$K$19:$K$47,\">0\")","v":0},{"$f":"IF(OFFSET(INDEX('D.A. A'!$A$19:$A$47,MATCH(B45,'D.A. A'!$A$19:$A$47,0),1),0,12)=0,\"\",IF(LEN(OFFSET(INDEX('D.A. A'!$A$19:$A$47,MATCH(B45,'D.A. A'!$A$19:$A$47,0),1),0,12))>27,LEFT(OFFSET(INDEX('D.A. A'!$A$19:$A$47,MATCH(B45,'D.A. A'!$A$19:$A$47,0),1),0,12),27)&\"…\",OFFSET(INDEX('D.A. A'!$A$19:$A$47,MATCH(B45,'D.A. A'!$A$19:$A$47,0),1),0,12)))","v":""},null,null,null,""]
[null,"To Residential Rain Garden (4.2.3.C)",{"$f":"SUMIFS('D.A. A'!$B$19:$B$47,'D.A. A'!$A$19:$A$47,B46,'D.A. A'!$B$19:$B$47,\">0\")+SUMIFS('D.A. A'!$C$19:$C$47,'D.A. A'!$A$19:$A$47,B46,'D.A. A'!$C$19:$C$47,\">0\")","v":0},{"$f":"SUMIFS('D.A. A'!$K$19:$K$47,'D.A. A'!$A$19:$A$47,B46,'D.A. A'!$K$19:$K$47,\">0\")","v":0},{"$f":"IF(OFFSET(INDEX('D.A. A'!$A$19:$A$47,MATCH(B46,'D.A. A'!$A$19:$A$47,0),1),0,12)=0,\"\",IF(LEN(OFFSET(INDEX('D.A. A'!$A$19:$A$47,MATCH(B46,'D.A. A'!$A$19:$A$47,0),1),0,12))>27,LEFT(OFFSET(INDEX('D.A. A'!$A$19:$A$47,MATCH(B46,'D.A. A'!$A$19:$A$47,0),1),0,12),27)&\"…\",OFFSET(INDEX('D.A. A'!$A$19:$A$47,MATCH(B46,'D.A. A'!$A$19:$A$47,0),1),0,12)))","v":""},null,null,null,""]
[null,"To Rainwater Harvesting (4.2.8)",{"$f":"SUMIFS('D.A. A'!$B$19:$B$47,'D.A. A'!$A$19:$A$47,B47,'D.A. A'!$B$19:$B$47,\">0\")+SUMIFS('D.A. A'!$C$19:$C$47,'D.A. A'!$A$19:$A$47,B47,'D.A. A'!$C$19:$C$47,\">0\")","v":0},{"$f":"SUMIFS('D.A. A'!$K$19:$K$47,'D.A. A'!$A$19:$A$47,B47,'D.A. A'!$K$19:$K$47,\">0\")","v":0},{"$f":"IF(OFFSET(INDEX('D.A. A'!$A$19:$A$47,MATCH(B47,'D.A. A'!$A$19:$A$47,0),1),0,12)=0,\"\",IF(LEN(OFFSET(INDEX('D.A. A'!$A$19:$A$47,MATCH(B47,'D.A. A'!$A$19:$A$47,0),1),0,12))>27,LEFT(OFFSET(INDEX('D.A. A'!$A$19:$A$47,MATCH(B47,'D.A. A'!$A$19:$A$47,0),1),0,12),27)&\"…\",OFFSET(INDEX('D.A. A'!$A$19:$A$47,MATCH(B47,'D.A. A'!$A$19:$A$47,0),1),0,12)))","v":""},null,null,null,""]
[null,"Permeable Pavement, Level 1",{"$f":"SUMIFS('D.A. A'!$B$19:$B$47,'D.A. A'!$A$19:$A$47,B48,'D.A. A'!$B$19:$B$47,\">0\")+SUMIFS('D.A. A'!$C$19:$C$47,'D.A. A'!$A$19:$A$47,B48,'D.A. A'!$C$19:$C$47,\">0\")","v":0},{"$f":"SUMIFS('D.A. A'!$K$19:$K$47,'D.A. A'!$A$19:$A$47,B48,'D.A. A'!$K$19:$K$47,\">0\")","v":0},{"$f":"IF(OFFSET(INDEX('D.A. A'!$A$19:$A$47,MATCH(B48,'D.A. A'!$A$19:$A$47,0),1),0,12)=0,\"\",IF(LEN(OFFSET(INDEX('D.A. A'!$A$19:$A$47,MATCH(B48,'D.A. A'!$A$19:$A$47,0),1),0,12))>27,LEFT(OFFSET(INDEX('D.A. A'!$A$19:$A$47,MATCH(B48,'D.A. A'!$A$19:$A$47,0),1),0,12),27)&\"…\",OFFSET(INDEX('D.A. A'!$A$19:$A$47,MATCH(B48,'D.A. A'!$A$19:$A$47,0),1),0,12)))","v":""},null,null,null,""]
[null,"Permeable Pavement, Level 2 (infiltration)",{"$f":"SUMIFS('D.A. A'!$B$19:$B$47,'D.A. A'!$A$19:$A$47,B49,'D.A. A'!$B$19:$B$47,\">0\")+SUMIFS('D.A. A'!$C$19:$C$47,'D.A. A'!$A$19:$A$47,B49,'D.A. A'!$C$19:$C$47,\">0\")","v":0},{"$f":"SUMIFS('D.A. A'!$K$19:$K$47,'D.A. A'!$A$19:$A$47,B49,'D.A. A'!$K$19:$K$47,\">0\")","v":0},{"$f":"IF(OFFSET(INDEX('D.A. A'!$A$19:$A$47,MATCH(B49,'D.A. A'!$A$19:$A$47,0),1),0,12)=0,\"\",IF(LEN(OFFSET(INDEX('D.A. A'!$A$19:$A$47,MATCH(B49,'D.A. A'!$A$19:$A$47,0),1),0,12))>27,LEFT(OFFSET(INDEX('D.A. A'!$A$19:$A$47,MATCH(B49,'D.A. A'!$A$19:$A$47,0),1),0,12),27)&\"…\",OFFSET(INDEX('D.A. A'!$A$19:$A$47,MATCH(B49,'D.A. A'!$A$19:$A$47,0),1),0,12)))","v":""},null,null,null,""]
[null,"Permeable Pavement, Level 2 (infiltration & underdrain)",{"$f":"SUMIFS('D.A. A'!$B$19:$B$47,'D.A. A'!$A$19:$A$47,B50,'D.A. A'!$B$19:$B$47,\">0\")+SUMIFS('D.A. A'!$C$19:$C$47,'D.A. A'!$A$19:$A$47,B50,'D.A. A'!$C$19:$C$47,\">0\")","v":0},{"$f":"SUMIFS('D.A. A'!$K$19:$K$47,'D.A. A'!$A$19:$A$47,B50,'D.A. A'!$K$19:$K$47,\">0\")","v":0},{"$f":"IF(OFFSET(INDEX('D.A. A'!$A$19:$A$47,MATCH(B50,'D.A. A'!$A$19:$A$47,0),1),0,12)=0,\"\",IF(LEN(OFFSET(INDEX('D.A. A'!$A$19:$A$47,MATCH(B50,'D.A. A'!$A$19:$A$47,0),1),0,12))>27,LEFT(OFFSET(INDEX('D.A. A'!$A$19:$A$47,MATCH(B50,'D.A. A'!$A$19:$A$47,0),1),0,12),27)&\"…\",OFFSET(INDEX('D.A. A'!$A$19:$A$47,MATCH(B50,'D.A. A'!$A$19:$A$47,0),1),0,12)))","v":""},null,null,null,""]
[null,"Grass Swale A/B Soils",{"$f":"SUMIFS('D.A. A'!$B$19:$B$47,'D.A. A'!$A$19:$A$47,B51,'D.A. A'!$B$19:$B$47,\">0\")+SUMIFS('D.A. A'!$C$19:$C$47,'D.A. A'!$A$19:$A$47,B51,'D.A. A'!$C$19:$C$47,\">0\")","v":0},{"$f":"SUMIFS('D.A. A'!$K$19:$K$47,'D.A. A'!$A$19:$A$47,B51,'D.A. A'!$K$19:$K$47,\">0\")","v":0},{"$f":"IF(OFFSET(INDEX('D.A. A'!$A$19:$A$47,MATCH(B51,'D.A. A'!$A$19:$A$47,0),1),0,12)=0,\"\",IF(LEN(OFFSET(INDEX('D.A. A'!$A$19:$A$47,MATCH(B51,'D.A. A'!$A$19:$A$47,0),1),0,12))>27,LEFT(OFFSET(INDEX('D.A. A'!$A$19:$A$47,MATCH(B51,'D.A. A'!$A$19:$A$47,0),1),0,12),27)&\"…\",OFFSET(INDEX('D.A. A'!$A$19:$A$47,MATCH(B51,'D.A. A'!$A$19:$A$47,0),1),0,12)))","v":""},null,null,null,""]
[null,"Grass Swale C/D Soils",{"$f":"SUMIFS('D.A. A'!$B$19:$B$47,'D.A. A'!$A$19:$A$47,B52,'D.A. A'!$B$19:$B$47,\">0\")+SUMIFS('D.A. A'!$C$19:$C$47,'D.A. A'!$A$19:$A$47,B52,'D.A. A'!$C$19:$C$47,\">0\")","v":0},{"$f":"SUMIFS('D.A. A'!$K$19:$K$47,'D.A. A'!$A$19:$A$47,B52,'D.A. A'!$K$19:$K$47,\">0\")","v":0},{"$f":"IF(OFFSET(INDEX('D.A. A'!$A$19:$A$47,MATCH(B52,'D.A. A'!$A$19:$A$47,0),1),0,12)=0,\"\",IF(LEN(OFFSET(INDEX('D.A. A'!$A$19:$A$47,MATCH(B52,'D.A. A'!$A$19:$A$47,0),1),0,12))>27,LEFT(OFFSET(INDEX('D.A. A'!$A$19:$A$47,MATCH(B52,'D.A. A'!$A$19:$A$47,0),1),0,12),27)&\"…\",OFFSET(INDEX('D.A. A'!$A$19:$A$47,MATCH(B52,'D.A. A'!$A$19:$A$47,0),1),0,12)))","v":""},null,null,null,""]
[null,"Grass Swale in C/D Soil with Soil Amendments",{"$f":"SUMIFS('D.A. A'!$B$19:$B$47,'D.A. A'!$A$19:$A$47,B53,'D.A. A'!$B$19:$B$47,\">0\")+SUMIFS('D.A. A'!$C$19:$C$47,'D.A. A'!$A$19:$A$47,B53,'D.A. A'!$C$19:$C$47,\">0\")","v":0},{"$f":"SUMIFS('D.A. A'!$K$19:$K$47,'D.A. A'!$A$19:$A$47,B53,'D.A. A'!$K$19:$K$47,\">0\")","v":0},{"$f":"IF(OFFSET(INDEX('D.A. A'!$A$19:$A$47,MATCH(B53,'D.A. A'!$A$19:$A$47,0),1),0,12)=0,\"\",IF(LEN(OFFSET(INDEX('D.A. A'!$A$19:$A$47,MATCH(B53,'D.A. A'!$A$19:$A$47,0),1),0,12))>27,LEFT(OFFSET(INDEX('D.A. A'!$A$19:$A$47,MATCH(B53,'D.A. A'!$A$19:$A$47,0),1),0,12),27)&\"…\",OFFSET(INDEX('D.A. A'!$A$19:$A$47,MATCH(B53,'D.A. A'!$A$19:$A$47,0),1),0,12)))","v":""},null,null,null,""]
[null,"Water Quality Swale, Level 1",{"$f":"SUMIFS('D.A. A'!$B$19:$B$47,'D.A. A'!$A$19:$A$47,B54,'D.A. A'!$B$19:$B$47,\">0\")+SUMIFS('D.A. A'!$C$19:$C$47,'D.A. A'!$A$19:$A$47,B54,'D.A. A'!$C$19:$C$47,\">0\")","v":0},{"$f":"SUMIFS('D.A. A'!$K$19:$K$47,'D.A. A'!$A$19:$A$47,B54,'D.A. A'!$K$19:$K$47,\">0\")","v":0},{"$f":"IF(OFFSET(INDEX('D.A. A'!$A$19:$A$47,MATCH(B54,'D.A. A'!$A$19:$A$47,0),1),0,12)=0,\"\",IF(LEN(OFFSET(INDEX('D.A. A'!$A$19:$A$47,MATCH(B54,'D.A. A'!$A$19:$A$47,0),1),0,12))>27,LEFT(OFFSET(INDEX('D.A. A'!$A$19:$A$47,MATCH(B54,'D.A. A'!$A$19:$A$47,0),1),0,12),27)&\"…\",OFFSET(INDEX('D.A. A'!$A$19:$A$47,MATCH(B54,'D.A. A'!$A$19:$A$47,0),1),0,12)))","v":""},null,null,null,""]
[null,"Water Quality Swale, Level 2",{"$f":"SUMIFS('D.A. A'!$B$19:$B$47,'D.A. A'!$A$19:$A$47,B55,'D.A. A'!$B$19:$B$47,\">0\")+SUMIFS('D.A. A'!$C$19:$C$47,'D.A. A'!$A$19:$A$47,B55,'D.A. A'!$C$19:$C$47,\">0\")","v":0},{"$f":"SUMIFS('D.A. A'!$K$19:$K$47,'D.A. A'!$A$19:$A$47,B55,'D.A. A'!$K$19:$K$47,\">0\")","v":0},{"$f":"IF(OFFSET(INDEX('D.A. A'!$A$19:$A$47,MATCH(B55,'D.A. A'!$A$19:$A$47,0),1),0,12)=0,\"\",IF(LEN(OFFSET(INDEX('D.A. A'!$A$19:$A$47,MATCH(B55,'D.A. A'!$A$19:$A$47,0),1),0,12))>27,LEFT(OFFSET(INDEX('D.A. A'!$A$19:$A$47,MATCH(B55,'D.A. A'!$A$19:$A$47,0),1),0,12),27)&\"…\",OFFSET(INDEX('D.A. A'!$A$19:$A$47,MATCH(B55,'D.A. A'!$A$19:$A$47,0),1),0,12)))","v":""},null,null,null,""]
[null,"Bioretention, Level 1 or Urban Bioretention (4.2.3.B)",{"$f":"SUMIFS('D.A. A'!$B$19:$B$47,'D.A. A'!$A$19:$A$47,B56,'D.A. A'!$B$19:$B$47,\">0\")+SUMIFS('D.A. A'!$C$19:$C$47,'D.A. A'!$A$19:$A$47,B56,'D.A. A'!$C$19:$C$47,\">0\")","v":0},{"$f":"SUMIFS('D.A. A'!$K$19:$K$47,'D.A. A'!$A$19:$A$47,B56,'D.A. A'!$K$19:$K$47,\">0\")","v":0},{"$f":"IF(OFFSET(INDEX('D.A. A'!$A$19:$A$47,MATCH(B56,'D.A. A'!$A$19:$A$47,0),1),0,12)=0,\"\",IF(LEN(OFFSET(INDEX('D.A. A'!$A$19:$A$47,MATCH(B56,'D.A. A'!$A$19:$A$47,0),1),0,12))>27,LEFT(OFFSET(INDEX('D.A. A'!$A$19:$A$47,MATCH(B56,'D.A. A'!$A$19:$A$47,0),1),0,12),27)&\"…\",OFFSET(INDEX('D.A. A'!$A$19:$A$47,MATCH(B56,'D.A. A'!$A$19:$A$47,0),1),0,12)))","v":""},null,null,null,""]
[null,"Bioretention, Level 2",{"$f":"SUMIFS('D.A. A'!$B$19:$B$47,'D.A. A'!$A$19:$A$47,B57,'D.A. A'!$B$19:$B$47,\">0\")+SUMIFS('D.A. A'!$C$19:$C$47,'D.A. A'!$A$19:$A$47,B57,'D.A. A'!$C$19:$C$47,\">0\")","v":0},{"$f":"SUMIFS('D.A. A'!$K$19:$K$47,'D.A. A'!$A$19:$A$47,B57,'D.A. A'!$K$19:$K$47,\">0\")","v":0},{"$f":"IF(OFFSET(INDEX('D.A. A'!$A$19:$A$47,MATCH(B57,'D.A. A'!$A$19:$A$47,0),1),0,12)=0,\"\",IF(LEN(OFFSET(INDEX('D.A. A'!$A$19:$A$47,MATCH(B57,'D.A. A'!$A$19:$A$47,0),1),0,12))>27,LEFT(OFFSET(INDEX('D.A. A'!$A$19:$A$47,MATCH(B57,'D.A. A'!$A$19:$A$47,0),1),0,12),27)&\"…\",OFFSET(INDEX('D.A. A'!$A$19:$A$47,MATCH(B57,'D.A. A'!$A$19:$A$47,0),1),0,12)))","v":""},null,null,null,""]
[null,"Infiltration",{"$f":"SUMIFS('D.A. A'!$B$19:$B$47,'D.A. A'!$A$19:$A$47,B58,'D.A. A'!$B$19:$B$47,\">0\")+SUMIFS('D.A. A'!$C$19:$C$47,'D.A. A'!$A$19:$A$47,B58,'D.A. A'!$C$19:$C$47,\">0\")","v":0},{"$f":"SUMIFS('D.A. A'!$K$19:$K$47,'D.A. A'!$A$19:$A$47,B58,'D.A. A'!$K$19:$K$47,\">0\")","v":0},{"$f":"IF(OFFSET(INDEX('D.A. A'!$A$19:$A$47,MATCH(B58,'D.A. A'!$A$19:$A$47,0),1),0,12)=0,\"\",IF(LEN(OFFSET(INDEX('D.A. A'!$A$19:$A$47,MATCH(B58,'D.A. A'!$A$19:$A$47,0),1),0,12))>27,LEFT(OFFSET(INDEX('D.A. A'!$A$19:$A$47,MATCH(B58,'D.A. A'!$A$19:$A$47,0),1),0,12),27)&\"…\",OFFSET(INDEX('D.A. A'!$A$19:$A$47,MATCH(B58,'D.A. A'!$A$19:$A$47,0),1),0,12)))","v":""},null,null,null,""]
[null,"*Filtration Practice/Stormwater Wetland do NOT receive runoff reduction values, but do have associated pollutant removal values",{"$f":"SUMIFS('D.A. A'!$B$19:$B$47,'D.A. A'!$A$19:$A$47,B59,'D.A. A'!$B$19:$B$47,\">0\")+SUMIFS('D.A. A'!$C$19:$C$47,'D.A. A'!$A$19:$A$47,B59,'D.A. A'!$C$19:$C$47,\">0\")","v":0},{"$f":"SUMIFS('D.A. A'!$K$19:$K$47,'D.A. A'!$A$19:$A$47,B59,'D.A. A'!$K$19:$K$47,\">0\")","v":0},{"$f":"IF(OFFSET(INDEX('D.A. A'!$A$19:$A$47,MATCH(B59,'D.A. A'!$A$19:$A$47,0),1),0,12)=0,\"\",IF(LEN(OFFSET(INDEX('D.A. A'!$A$19:$A$47,MATCH(B59,'D.A. A'!$A$19:$A$47,0),1),0,12))>27,LEFT(OFFSET(INDEX('D.A. A'!$A$19:$A$47,MATCH(B59,'D.A. A'!$A$19:$A$47,0),1),0,12),27)&\"…\",OFFSET(INDEX('D.A. A'!$A$19:$A$47,MATCH(B59,'D.A. A'!$A$19:$A$47,0),1),0,12)))","v":""},null,null,null,""]
[null,"Sheetflow to Conservation Area with A/B Soils",{"$f":"SUMIFS('D.A. A'!$B$19:$B$47,'D.A. A'!$A$19:$A$47,B60,'D.A. A'!$B$19:$B$47,\">0\")+SUMIFS('D.A. A'!$C$19:$C$47,'D.A. A'!$A$19:$A$47,B60,'D.A. A'!$C$19:$C$47,\">0\")","v":0},{"$f":"SUMIFS('D.A. A'!$K$19:$K$47,'D.A. A'!$A$19:$A$47,B60,'D.A. A'!$K$19:$K$47,\">0\")","v":0},{"$f":"IF(OFFSET(INDEX('D.A. A'!$A$19:$A$47,MATCH(B60,'D.A. A'!$A$19:$A$47,0),1),0,12)=0,\"\",IF(LEN(OFFSET(INDEX('D.A. A'!$A$19:$A$47,MATCH(B60,'D.A. A'!$A$19:$A$47,0),1),0,12))>27,LEFT(OFFSET(INDEX('D.A. A'!$A$19:$A$47,MATCH(B60,'D.A. A'!$A$19:$A$47,0),1),0,12),27)&\"…\",OFFSET(INDEX('D.A. A'!$A$19:$A$47,MATCH(B60,'D.A. A'!$A$19:$A$47,0),1),0,12)))","v":""},null,null,null,""]
[null,"Sheetflow to Conservation Area with C/D Soils",{"$f":"SUMIFS('D.A. A'!$B$19:$B$47,'D.A. A'!$A$19:$A$47,B61,'D.A. A'!$B$19:$B$47,\">0\")+SUMIFS('D.A. A'!$C$19:$C$47,'D.A. A'!$A$19:$A$47,B61,'D.A. A'!$C$19:$C$47,\">0\")","v":0},{"$f":"SUMIFS('D.A. A'!$K$19:$K$47,'D.A. A'!$A$19:$A$47,B61,'D.A. A'!$K$19:$K$47,\">0\")","v":0},{"$f":"IF(OFFSET(INDEX('D.A. A'!$A$19:$A$47,MATCH(B61,'D.A. A'!$A$19:$A$47,0),1),0,12)=0,\"\",IF(LEN(OFFSET(INDEX('D.A. A'!$A$19:$A$47,MATCH(B61,'D.A. A'!$A$19:$A$47,0),1),0,12))>27,LEFT(OFFSET(INDEX('D.A. A'!$A$19:$A$47,MATCH(B61,'D.A. A'!$A$19:$A$47,0),1),0,12),27)&\"…\",OFFSET(INDEX('D.A. A'!$A$19:$A$47,MATCH(B61,'D.A. A'!$A$19:$A$47,0),1),0,12)))","v":""},null,null,null,""]
[null,"Sheetflow to Vegetated Filter Strip in A/B Soils or Compost Amended C/D Soils",{"$f":"SUMIFS('D.A. A'!$B$19:$B$47,'D.A. A'!$A$19:$A$47,B62,'D.A. A'!$B$19:$B$47,\">0\")+SUMIFS('D.A. A'!$C$19:$C$47,'D.A. A'!$A$19:$A$47,B62,'D.A. A'!$C$19:$C$47,\">0\")","v":0},{"$f":"SUMIFS('D.A. A'!$K$19:$K$47,'D.A. A'!$A$19:$A$47,B62,'D.A. A'!$K$19:$K$47,\">0\")","v":0},{"$f":"IF(OFFSET(INDEX('D.A. A'!$A$19:$A$47,MATCH(B62,'D.A. A'!$A$19:$A$47,0),1),0,12)=0,\"\",IF(LEN(OFFSET(INDEX('D.A. A'!$A$19:$A$47,MATCH(B62,'D.A. A'!$A$19:$A$47,0),1),0,12))>27,LEFT(OFFSET(INDEX('D.A. A'!$A$19:$A$47,MATCH(B62,'D.A. A'!$A$19:$A$47,0),1),0,12),27)&\"…\",OFFSET(INDEX('D.A. A'!$A$19:$A$47,MATCH(B62,'D.A. A'!$A$19:$A$47,0),1),0,12)))","v":""},null,null,null,""]
[null,"Sheet flow to Vegetated Filter Strip in C/D Soils",{"$f":"SUMIFS('D.A. A'!$B$19:$B$47,'D.A. A'!$A$19:$A$47,B63,'D.A. A'!$B$19:$B$47,\">0\")+SUMIFS('D.A. A'!$C$19:$C$47,'D.A. A'!$A$19:$A$47,B63,'D.A. A'!$C$19:$C$47,\">0\")","v":0},{"$f":"SUMIFS('D.A. A'!$K$19:$K$47,'D.A. A'!$A$19:$A$47,B63,'D.A. A'!$K$19:$K$47,\">0\")","v":0},{"$f":"IF(OFFSET(INDEX('D.A. A'!$A$19:$A$47,MATCH(B63,'D.A. A'!$A$19:$A$47,0),1),0,12)=0,\"\",IF(LEN(OFFSET(INDEX('D.A. A'!$A$19:$A$47,MATCH(B63,'D.A. A'!$A$19:$A$47,0),1),0,12))>27,LEFT(OFFSET(INDEX('D.A. A'!$A$19:$A$47,MATCH(B63,'D.A. A'!$A$19:$A$47,0),1),0,12),27)&\"…\",OFFSET(INDEX('D.A. A'!$A$19:$A$47,MATCH(B63,'D.A. A'!$A$19:$A$47,0),1),0,12)))","v":""},null,null,null,""]
[null,null,null,null,null,null,null,null,{"$f":"IF(SUM($C$24:$C$26)<>0,1,\"\")","v":""}]
[null,"Total Impervious Cover Treated (acres)",{"$f":"'D.A. A'!B48","v":0},null,null,null,null,null,{"$f":"IF(SUM($C$24:$C$26)<>0,1,\"\")","v":""}]
[null,"Total Turf Area Treated (acres) ",{"$f":"'D.A. A'!C48","v":0},null,null,null,null,null,{"$f":"IF(SUM($C$24:$C$26)<>0,1,\"\")","v":""}]
[]
[]
[null,"Drainage Area B Summary",null,null,null,null,null,null,{"$f":"IF(SUM($D$24:$D$26)<>0,1,\"\")","v":""}]
[null,null,null,null,null,null,null,null,{"$f":"IF(SUM($D$24:$D$26)<>0,1,\"\")","v":""}]
[null,"Land Cover Summary",null,null,null,null,null,null,""]
[null,null,null,null,null,null,null,null,""]
[null,null,"A Soils","B Soils","C Soils","D Soils","Total","% of Total",""]
[null,"Forest (acres)",{"$f":"'Site Data'!B24","v":0},{"$f":"'Site Data'!C24","v":0},{"$f":"'Site Data'!D24","v":0},{"$f":"'Site Data'!E24","v":0},{"$f":"'Site Data'!F24","v":0},{"$f":"IF(G$38>0,G74/G$38*100,0)","v":0},""]
[null,"Turf (acres)",{"$f":"'Site Data'!B25","v":0},{"$f":"'Site Data'!C25","v":0},{"$f":"'Site Data'!D25","v":0},{"$f":"'Site Data'!E25","v":0},{"$f":"'Site Data'!F25","v":0},{"$f":"IF(G$38>0,G75/G$38*100,0)","v":0},""]
[null,"Impervious (acres)",{"$f":"'Site Data'!B26","v":0},{"$f":"'Site Data'!C26","v":0},{"$f":"'Site Data'!D26","v":0},{"$f":"'Site Data'!E26","v":0},{"$f":"'Site Data'!F26","v":0},{"$f":"IF(G$38>0,G76/G$38*100,0)","v":0},""]
[null,null,null,null,null,null,{"$f":"SUM(G74:G76)","v":0},null,""]
[null,null,null,null,null,null,null,null,""]
[null,"BMP Selections",null,null,null,null,null,null,""]
[null,null,null,null,null,null,null,null,""]
[null,{"$f":"IF(SUM(I82:I102)>0,\"Practice\",\"No Practices in this Drainage Area\")","v":"No Practices in this Drainage Area"},"Credit Area (acres)","Runoff Reduction (ft3)","Downstream Practice",null,null,null,""]
[null,"Vegetated Roof",{"$f":"SUMIFS('D.A. B'!$B$19:$B$47,'D.A. B'!$A$19:$A$47,B82,'D.A. B'!$B$19:$B$47,\">0\")+SUMIFS('D.A. B'!$C$19:$C$47,'D.A. B'!$A$19:$A$47,B82,'D.A. B'!$C$19:$C$47,\">0\")","v":0},{"$f":"SUMIFS('D.A. B'!$K$19:$K$47,'D.A. B'!$A$19:$A$47,B82,'D.A. B'!$K$19:$K$47,\">0\")","v":0},{"$f":"IF(OFFSET(INDEX('D.A. B'!$A$19:$A$47,MATCH(B82,'D.A. B'!$A$19:$A$47,0),1),0,12)=0,\"\",IF(LEN(OFFSET(INDEX('D.A. B'!$A$19:$A$47,MATCH(B82,'D.A. B'!$A$19:$A$47,0),1),0,12))>27,LEFT(OFFSET(INDEX('D.A. B'!$A$19:$A$47,MATCH(B82,'D.A. B'!$A$19:$A$47,0),1),0,12),27)&\"…\",OFFSET(INDEX('D.A. B'!$A$19:$A$47,MATCH(B82,'D.A. B'!$A$19:$A$47,0),1),0,12)))","v":""},null,null,null,{"$f":"IF(AND(D82>0,SUM($D$24:$D$26)>0),1,\"\")","v":""}]
[null,"Simple Disconnection to A/B Soils or Soil-Amended Filter Path in C/D Soils (4.2.2, Appendix D)",{"$f":"SUMIFS('D.A. B'!$B$19:$B$47,'D.A. B'!$A$19:$A$47,B83,'D.A. B'!$B$19:$B$47,\">0\")+SUMIFS('D.A. B'!$C$19:$C$47,'D.A. B'!$A$19:$A$47,B83,'D.A. B'!$C$19:$C$47,\">0\")","v":0},{"$f":"SUMIFS('D.A. B'!$K$19:$K$47,'D.A. B'!$A$19:$A$47,B83,'D.A. B'!$K$19:$K$47,\">0\")","v":0},{"$f":"IF(OFFSET(INDEX('D.A. B'!$A$19:$A$47,MATCH(B83,'D.A. B'!$A$19:$A$47,0),1),0,12)=0,\"\",IF(LEN(OFFSET(INDEX('D.A. B'!$A$19:$A$47,MATCH(B83,'D.A. B'!$A$19:$A$47,0),1),0,12))>27,LEFT(OFFSET(INDEX('D.A. B'!$A$19:$A$47,MATCH(B83,'D.A. B'!$A$19:$A$47,0),1),0,12),27)&\"…\",OFFSET(INDEX('D.A. B'!$A$19:$A$47,MATCH(B83,'D.A. B'!$A$19:$A$47,0),1),0,12)))","v":""},null,null,null,{"$f":"IF(AND(D83>0,SUM($D$24:$D$26)>0),1,\"\")","v":""}]
[null,"Simple Disconnection to C/D Soils (4.2.2)",{"$f":"SUMIFS('D.A. B'!$B$19:$B$47,'D.A. B'!$A$19:$A$47,B84,'D.A. B'!$B$19:$B$47,\">0\")+SUMIFS('D.A. B'!$C$19:$C$47,'D.A. B'!$A$19:$A$47,B84,'D.A. B'!$C$19:$C$47,\">0\")","v":0},{"$f":"SUMIFS('D.A. B'!$K$19:$K$47,'D.A. B'!$A$19:$A$47,B84,'D.A. B'!$K$19:$K$47,\">0\")","v":0},{"$f":"IF(OFFSET(INDEX('D.A. B'!$A$19:$A$47,MATCH(B84,'D.A. B'!$A$19:$A$47,0),1),0,12)=0,\"\",IF(LEN(OFFSET(INDEX('D.A. B'!$A$19:$A$47,MATCH(B84,'D.A. B'!$A$19:$A$47,0),1),0,12))>27,LEFT(OFFSET(INDEX('D.A. B'!$A$19:$A$47,MATCH(B84,'D.A. B'!$A$19:$A$47,0),1),0,12),27)&\"…\",OFFSET(INDEX('D.A. B'!$A$19:$A$47,MATCH(B84,'D.A. B'!$A$19:$A$47,0),1),0,12)))","v":""},null,null,null,""]
[null,"To Residential Rain Garden (4.2.3.C)",{"$f":"SUMIFS('D.A. B'!$B$19:$B$47,'D.A. B'!$A$19:$A$47,B85,'D.A. B'!$B$19:$B$47,\">0\")+SUMIFS('D.A. B'!$C$19:$C$47,'D.A. B'!$A$19:$A$47,B85,'D.A. B'!$C$19:$C$47,\">0\")","v":0},{"$f":"SUMIFS('D.A. B'!$K$19:$K$47,'D.A. B'!$A$19:$A$47,B85,'D.A. B'!$K$19:$K$47,\">0\")","v":0},{"$f":"IF(OFFSET(INDEX('D.A. B'!$A$19:$A$47,MATCH(B85,'D.A. B'!$A$19:$A$47,0),1),0,12)=0,\"\",IF(LEN(OFFSET(INDEX('D.A. B'!$A$19:$A$47,MATCH(B85,'D.A. B'!$A$19:$A$47,0),1),0,12))>27,LEFT(OFFSET(INDEX('D.A. B'!$A$19:$A$47,MATCH(B85,'D.A. B'!$A$19:$A$47,0),1),0,12),27)&\"…\",OFFSET(INDEX('D.A. B'!$A$19:$A$47,MATCH(B85,'D.A. B'!$A$19:$A$47,0),1),0,12)))","v":""},null,null,null,""]
[null,"To Rainwater Harvesting (4.2.8)",{"$f":"SUMIFS('D.A. B'!$B$19:$B$47,'D.A. B'!$A$19:$A$47,B86,'D.A. B'!$B$19:$B$47,\">0\")+SUMIFS('D.A. B'!$C$19:$C$47,'D.A. B'!$A$19:$A$47,B86,'D.A. B'!$C$19:$C$47,\">0\")","v":0},{"$f":"SUMIFS('D.A. B'!$K$19:$K$47,'D.A. B'!$A$19:$A$47,B86,'D.A. B'!$K$19:$K$47,\">0\")","v":0},{"$f":"IF(OFFSET(INDEX('D.A. B'!$A$19:$A$47,MATCH(B86,'D.A. B'!$A$19:$A$47,0),1),0,12)=0,\"\",IF(LEN(OFFSET(INDEX('D.A. B'!$A$19:$A$47,MATCH(B86,'D.A. B'!$A$19:$A$47,0),1),0,12))>27,LEFT(OFFSET(INDEX('D.A. B'!$A$19:$A$47,MATCH(B86,'D.A. B'!$A$19:$A$47,0),1),0,12),27)&\"…\",OFFSET(INDEX('D.A. B'!$A$19:$A$47,MATCH(B86,'D.A. B'!$A$19:$A$47,0),1),0,12)))","v":""},null,null,null,""]
[null,"Permeable Pavement, Level 1",{"$f":"SUMIFS('D.A. B'!$B$19:$B$47,'D.A. B'!$A$19:$A$47,B87,'D.A. B'!$B$19:$B$47,\">0\")+SUMIFS('D.A. B'!$C$19:$C$47,'D.A. B'!$A$19:$A$47,B87,'D.A. B'!$C$19:$C$47,\">0\")","v":0},{"$f":"SUMIFS('D.A. B'!$K$19:$K$47,'D.A. B'!$A$19:$A$47,B87,'D.A. B'!$K$19:$K$47,\">0\")","v":0},{"$f":"IF(OFFSET(INDEX('D.A. B'!$A$19:$A$47,MATCH(B87,'D.A. B'!$A$19:$A$47,0),1),0,12)=0,\"\",IF(LEN(OFFSET(INDEX('D.A. B'!$A$19:$A$47,MATCH(B87,'D.A. B'!$A$19:$A$47,0),1),0,12))>27,LEFT(OFFSET(INDEX('D.A. B'!$A$19:$A$47,MATCH(B87,'D.A. B'!$A$19:$A$47,0),1),0,12),27)&\"…\",OFFSET(INDEX('D.A. B'!$A$19:$A$47,MATCH(B87,'D.A. B'!$A$19:$A$47,0),1),0,12)))","v":""},null,null,null,""]
[null,"Permeable Pavement, Level 2 (infiltration)",{"$f":"SUMIFS('D.A. B'!$B$19:$B$47,'D.A. B'!$A$19:$A$47,B88,'D.A. B'!$B$19:$B$47,\">0\")+SUMIFS('D.A. B'!$C$19:$C$47,'D.A. B'!$A$19:$A$47,B88,'D.A. B'!$C$19:$C$47,\">0\")","v":0},{"$f":"SUMIFS('D.A. B'!$K$19:$K$47,'D.A. B'!$A$19:$A$47,B88,'D.A. B'!$K$19:$K$47,\">0\")","v":0},{"$f":"IF(OFFSET(INDEX('D.A. B'!$A$19:$A$47,MATCH(B88,'D.A. B'!$A$19:$A$47,0),1),0,12)=0,\"\",IF(LEN(OFFSET(INDEX('D.A. B'!$A$19:$A$47,MATCH(B88,'D.A. B'!$A$19:$A$47,0),1),0,12))>27,LEFT(OFFSET(INDEX('D.A. B'!$A$19:$A$47,MATCH(B88,'D.A. B'!$A$19:$A$47,0),1),0,12),27)&\"…\",OFFSET(INDEX('D.A. B'!$A$19:$A$47,MATCH(B88,'D.A. B'!$A$19:$A$47,0),1),0,12)))","v":""},null,null,null,""]
[null,"Permeable Pavement, Level 2 (infiltration & underdrain)",{"$f":"SUMIFS('D.A. B'!$B$19:$B$47,'D.A. B'!$A$19:$A$47,B89,'D.A. B'!$B$19:$B$47,\">0\")+SUMIFS('D.A. B'!$C$19:$C$47,'D.A. B'!$A$19:$A$47,B89,'D.A. B'!$C$19:$C$47,\">0\")","v":0},{"$f":"SUMIFS('D.A. B'!$K$19:$K$47,'D.A. B'!$A$19:$A$47,B89,'D.A. B'!$K$19:$K$47,\">0\")","v":0},{"$f":"IF(OFFSET(INDEX('D.A. B'!$A$19:$A$47,MATCH(B89,'D.A. B'!$A$19:$A$47,0),1),0,12)=0,\"\",IF(LEN(OFFSET(INDEX('D.A. B'!$A$19:$A$47,MATCH(B89,'D.A. B'!$A$19:$A$47,0),1),0,12))>27,LEFT(OFFSET(INDEX('D.A. B'!$A$19:$A$47,MATCH(B89,'D.A. B'!$A$19:$A$47,0),1),0,12),27)&\"…\",OFFSET(INDEX('D.A. B'!$A$19:$A$47,MATCH(B89,'D.A. B'!$A$19:$A$47,0),1),0,12)))","v":""},null,null,null,""]
[null,"Grass Swale A/B Soils",{"$f":"SUMIFS('D.A. B'!$B$19:$B$47,'D.A. B'!$A$19:$A$47,B90,'D.A. B'!$B$19:$B$47,\">0\")+SUMIFS('D.A. B'!$C$19:$C$47,'D.A. B'!$A$19:$A$47,B90,'D.A. B'!$C$19:$C$47,\">0\")","v":0},{"$f":"SUMIFS('D.A. B'!$K$19:$K$47,'D.A. B'!$A$19:$A$47,B90,'D.A. B'!$K$19:$K$47,\">0\")","v":0},{"$f":"IF(OFFSET(INDEX('D.A. B'!$A$19:$A$47,MATCH(B90,'D.A. B'!$A$19:$A$47,0),1),0,12)=0,\"\",IF(LEN(OFFSET(INDEX('D.A. B'!$A$19:$A$47,MATCH(B90,'D.A. B'!$A$19:$A$47,0),1),0,12))>27,LEFT(OFFSET(INDEX('D.A. B'!$A$19:$A$47,MATCH(B90,'D.A. B'!$A$19:$A$47,0),1),0,12),27)&\"…\",OFFSET(INDEX('D.A. B'!$A$19:$A$47,MATCH(B90,'D.A. B'!$A$19:$A$47,0),1),0,12)))","v":""},null,null,null,""]
[null,"Grass Swale C/D Soils",{"$f":"SUMIFS('D.A. B'!$B$19:$B$47,'D.A. B'!$A$19:$A$47,B91,'D.A. B'!$B$19:$B$47,\">0\")+SUMIFS('D.A. B'!$C$19:$C$47,'D.A. B'!$A$19:$A$47,B91,'D.A. B'!$C$19:$C$47,\">0\")","v":0},{"$f":"SUMIFS('D.A. B'!$K$19:$K$47,'D.A. B'!$A$19:$A$47,B91,'D.A. B'!$K$19:$K$47,\">0\")","v":0},{"$f":"IF(OFFSET(INDEX('D.A. B'!$A$19:$A$47,MATCH(B91,'D.A. B'!$A$19:$A$47,0),1),0,12)=0,\"\",IF(LEN(OFFSET(INDEX('D.A. B'!$A$19:$A$47,MATCH(B91,'D.A. B'!$A$19:$A$47,0),1),0,12))>27,LEFT(OFFSET(INDEX('D.A. B'!$A$19:$A$47,MATCH(B91,'D.A. B'!$A$19:$A$47,0),1),0,12),27)&\"…\",OFFSET(INDEX('D.A. B'!$A$19:$A$47,MATCH(B91,'D.A. B'!$A$19:$A$47,0),1),0,12)))","v":""},null,null,null,""]
[null,"Grass Swale in C/D Soil with Soil Amendments",{"$f":"SUMIFS('D.A. B'!$B$19:$B$47,'D.A. B'!$A$19:$A$47,B92,'D.A. B'!$B$19:$B$47,\">0\")+SUMIFS('D.A. B'!$C$19:$C$47,'D.A. B'!$A$19:$A$47,B92,'D.A. B'!$C$19:$C$47,\">0\")","v":0},{"$f":"SUMIFS('D.A. B'!$K$19:$K$47,'D.A. B'!$A$19:$A$47,B92,'D.A. B'!$K$19:$K$47,\">0\")","v":0},{"$f":"IF(OFFSET(INDEX('D.A. B'!$A$19:$A$47,MATCH(B92,'D.A. B'!$A$19:$A$47,0),1),0,12)=0,\"\",IF(LEN(OFFSET(INDEX('D.A. B'!$A$19:$A$47,MATCH(B92,'D.A. B'!$A$19:$A$47,0),1),0,12))>27,LEFT(OFFSET(INDEX('D.A. B'!$A$19:$A$47,MATCH(B92,'D.A. B'!$A$19:$A$47,0),1),0,12),27)&\"…\",OFFSET(INDEX('D.A. B'!$A$19:$A$47,MATCH(B92,'D.A. B'!$A$19:$A$47,0),1),0,12)))","v":""},null,null,null,""]
[null,"Water Quality Swale, Level 1",{"$f":"SUMIFS('D.A. B'!$B$19:$B$47,'D.A. B'!$A$19:$A$47,B93,'D.A. B'!$B$19:$B$47,\">0\")+SUMIFS('D.A. B'!$C$19:$C$47,'D.A. B'!$A$19:$A$47,B93,'D.A. B'!$C$19:$C$47,\">0\")","v":0},{"$f":"SUMIFS('D.A. B'!$K$19:$K$47,'D.A. B'!$A$19:$A$47,B93,'D.A. B'!$K$19:$K$47,\">0\")","v":0},{"$f":"IF(OFFSET(INDEX('D.A. B'!$A$19:$A$47,MATCH(B93,'D.A. B'!$A$19:$A$47,0),1),0,12)=0,\"\",IF(LEN(OFFSET(INDEX('D.A. B'!$A$19:$A$47,MATCH(B93,'D.A. B'!$A$19:$A$47,0),1),0,12))>27,LEFT(OFFSET(INDEX('D.A. B'!$A$19:$A$47,MATCH(B93,'D.A. B'!$A$19:$A$47,0),1),0,12),27)&\"…\",OFFSET(INDEX('D.A. B'!$A$19:$A$47,MATCH(B93,'D.A. B'!$A$19:$A$47,0),1),0,12)))","v":""},null,null,null,""]
[null,"Water Quality Swale, Level 2",{"$f":"SUMIFS('D.A. B'!$B$19:$B$47,'D.A. B'!$A$19:$A$47,B94,'D.A. B'!$B$19:$B$47,\">0\")+SUMIFS('D.A. B'!$C$19:$C$47,'D.A. B'!$A$19:$A$47,B94,'D.A. B'!$C$19:$C$47,\">0\")","v":0},{"$f":"SUMIFS('D.A. B'!$K$19:$K$47,'D.A. B'!$A$19:$A$47,B94,'D.A. B'!$K$19:$K$47,\">0\")","v":0},{"$f":"IF(OFFSET(INDEX('D.A. B'!$A$19:$A$47,MATCH(B94,'D.A. B'!$A$19:$A$47,0),1),0,12)=0,\"\",IF(LEN(OFFSET(INDEX('D.A. B'!$A$19:$A$47,MATCH(B94,'D.A. B'!$A$19:$A$47,0),1),0,12))>27,LEFT(OFFSET(INDEX('D.A. B'!$A$19:$A$47,MATCH(B94,'D.A. B'!$A$19:$A$47,0),1),0,12),27)&\"…\",OFFSET(INDEX('D.A. B'!$A$19:$A$47,MATCH(B94,'D.A. B'!$A$19:$A$47,0),1),0,12)))","v":""},null,null,null,""]
[null,"Bioretention, Level 1 or Urban Bioretention (4.2.3.B)",{"$f":"SUMIFS('D.A. B'!$B$19:$B$47,'D.A. B'!$A$19:$A$47,B95,'D.A. B'!$B$19:$B$47,\">0\")+SUMIFS('D.A. B'!$C$19:$C$47,'D.A. B'!$A$19:$A$47,B95,'D.A. B'!$C$19:$C$47,\">0\")","v":0},{"$f":"SUMIFS('D.A. B'!$K$19:$K$47,'D.A. B'!$A$19:$A$47,B95,'D.A. B'!$K$19:$K$47,\">0\")","v":0},{"$f":"IF(OFFSET(INDEX('D.A. B'!$A$19:$A$47,MATCH(B95,'D.A. B'!$A$19:$A$47,0),1),0,12)=0,\"\",IF(LEN(OFFSET(INDEX('D.A. B'!$A$19:$A$47,MATCH(B95,'D.A. B'!$A$19:$A$47,0),1),0,12))>27,LEFT(OFFSET(INDEX('D.A. B'!$A$19:$A$47,MATCH(B95,'D.A. B'!$A$19:$A$47,0),1),0,12),27)&\"…\",OFFSET(INDEX('D.A. B'!$A$19:$A$47,MATCH(B95,'D.A. B'!$A$19:$A$47,0),1),0,12)))","v":""},null,null,null,""]
[null,"Bioretention, Level 2",{"$f":"SUMIFS('D.A. B'!$B$19:$B$47,'D.A. B'!$A$19:$A$47,B96,'D.A. B'!$B$19:$B$47,\">0\")+SUMIFS('D.A. B'!$C$19:$C$47,'D.A. B'!$A$19:$A$47,B96,'D.A. B'!$C$19:$C$47,\">0\")","v":0},{"$f":"SUMIFS('D.A. B'!$K$19:$K$47,'D.A. B'!$A$19:$A$47,B96,'D.A. B'!$K$19:$K$47,\">0\")","v":0},{"$f":"IF(OFFSET(INDEX('D.A. B'!$A$19:$A$47,MATCH(B96,'D.A. B'!$A$19:$A$47,0),1),0,12)=0,\"\",IF(LEN(OFFSET(INDEX('D.A. B'!$A$19:$A$47,MATCH(B96,'D.A. B'!$A$19:$A$47,0),1),0,12))>27,LEFT(OFFSET(INDEX('D.A. B'!$A$19:$A$47,MATCH(B96,'D.A. B'!$A$19:$A$47,0),1),0,12),27)&\"…\",OFFSET(INDEX('D.A. B'!$A$19:$A$47,MATCH(B96,'D.A. B'!$A$19:$A$47,0),1),0,12)))","v":""},null,null,null,""]
[null,"Infiltration",{"$f":"SUMIFS('D.A. B'!$B$19:$B$47,'D.A. B'!$A$19:$A$47,B97,'D.A. B'!$B$19:$B$47,\">0\")+SUMIFS('D.A. B'!$C$19:$C$47,'D.A. B'!$A$19:$A$47,B97,'D.A. B'!$C$19:$C$47,\">0\")","v":0},{"$f":"SUMIFS('D.A. B'!$K$19:$K$47,'D.A. B'!$A$19:$A$47,B97,'D.A. B'!$K$19:$K$47,\">0\")","v":0},{"$f":"IF(OFFSET(INDEX('D.A. B'!$A$19:$A$47,MATCH(B97,'D.A. B'!$A$19:$A$47,0),1),0,12)=0,\"\",IF(LEN(OFFSET(INDEX('D.A. B'!$A$19:$A$47,MATCH(B97,'D.A. B'!$A$19:$A$47,0),1),0,12))>27,LEFT(OFFSET(INDEX('D.A. B'!$A$19:$A$47,MATCH(B97,'D.A. B'!$A$19:$A$47,0),1),0,12),27)&\"…\",OFFSET(INDEX('D.A. B'!$A$19:$A$47,MATCH(B97,'D.A. B'!$A$19:$A$47,0),1),0,12)))","v":""},null,null,null,""]
[null,"*Filtration Practice/Stormwater Wetland do NOT receive runoff reduction values, but do have associated pollutant removal values",{"$f":"SUMIFS('D.A. B'!$B$19:$B$47,'D.A. B'!$A$19:$A$47,B98,'D.A. B'!$B$19:$B$47,\">0\")+SUMIFS('D.A. B'!$C$19:$C$47,'D.A. B'!$A$19:$A$47,B98,'D.A. B'!$C$19:$C$47,\">0\")","v":0},{"$f":"SUMIFS('D.A. B'!$K$19:$K$47,'D.A. B'!$A$19:$A$47,B98,'D.A. B'!$K$19:$K$47,\">0\")","v":0},{"$f":"IF(OFFSET(INDEX('D.A. B'!$A$19:$A$47,MATCH(B98,'D.A. B'!$A$19:$A$47,0),1),0,12)=0,\"\",IF(LEN(OFFSET(INDEX('D.A. B'!$A$19:$A$47,MATCH(B98,'D.A. B'!$A$19:$A$47,0),1),0,12))>27,LEFT(OFFSET(INDEX('D.A. B'!$A$19:$A$47,MATCH(B98,'D.A. B'!$A$19:$A$47,0),1),0,12),27)&\"…\",OFFSET(INDEX('D.A. B'!$A$19:$A$47,MATCH(B98,'D.A. B'!$A$19:$A$47,0),1),0,12)))","v":""},null,null,null,""]
[null,"Sheetflow to Conservation Area with A/B Soils",{"$f":"SUMIFS('D.A. B'!$B$19:$B$47,'D.A. B'!$A$19:$A$47,B99,'D.A. B'!$B$19:$B$47,\">0\")+SUMIFS('D.A. B'!$C$19:$C$47,'D.A. B'!$A$19:$A$47,B99,'D.A. B'!$C$19:$C$47,\">0\")","v":0},{"$f":"SUMIFS('D.A. B'!$K$19:$K$47,'D.A. B'!$A$19:$A$47,B99,'D.A. B'!$K$19:$K$47,\">0\")","v":0},{"$f":"IF(OFFSET(INDEX('D.A. B'!$A$19:$A$47,MATCH(B99,'D.A. B'!$A$19:$A$47,0),1),0,12)=0,\"\",IF(LEN(OFFSET(INDEX('D.A. B'!$A$19:$A$47,MATCH(B99,'D.A. B'!$A$19:$A$47,0),1),0,12))>27,LEFT(OFFSET(INDEX('D.A. B'!$A$19:$A$47,MATCH(B99,'D.A. B'!$A$19:$A$47,0),1),0,12),27)&\"…\",OFFSET(INDEX('D.A. B'!$A$19:$A$47,MATCH(B99,'D.A. B'!$A$19:$A$47,0),1),0,12)))","v":""},null,null,null,""]
[null,"Sheetflow to Conservation Area with C/D Soils",{"$f":"SUMIFS('D.A. B'!$B$19:$B$47,'D.A. B'!$A$19:$A$47,B100,'D.A. B'!$B$19:$B$47,\">0\")+SUMIFS('D.A. B'!$C$19:$C$47,'D.A. B'!$A$19:$A$47,B100,'D.A. B'!$C$19:$C$47,\">0\")","v":0},{"$f":"SUMIFS('D.A. B'!$K$19:$K$47,'D.A. B'!$A$19:$A$47,B100,'D.A. B'!$K$19:$K$47,\">0\")","v":0},{"$f":"IF(OFFSET(INDEX('D.A. B'!$A$19:$A$47,MATCH(B100,'D.A. B'!$A$19:$A$47,0),1),0,12)=0,\"\",IF(LEN(OFFSET(INDEX('D.A. B'!$A$19:$A$47,MATCH(B100,'D.A. B'!$A$19:$A$47,0),1),0,12))>27,LEFT(OFFSET(INDEX('D.A. B'!$A$19:$A$47,MATCH(B100,'D.A. B'!$A$19:$A$47,0),1),0,12),27)&\"…\",OFFSET(INDEX('D.A. B'!$A$19:$A$47,MATCH(B100,'D.A. B'!$A$19:$A$47,0),1),0,12)))","v":""},null,null,null,""]
[null,"Sheetflow to Vegetated Filter Strip in A/B Soils or Compost Amended C/D Soils",{"$f":"SUMIFS('D.A. B'!$B$19:$B$47,'D.A. B'!$A$19:$A$47,B101,'D.A. B'!$B$19:$B$47,\">0\")+SUMIFS('D.A. B'!$C$19:$C$47,'D.A. B'!$A$19:$A$47,B101,'D.A. B'!$C$19:$C$47,\">0\")","v":0},{"$f":"SUMIFS('D.A. B'!$K$19:$K$47,'D.A. B'!$A$19:$A$47,B101,'D.A. B'!$K$19:$K$47,\">0\")","v":0},{"$f":"IF(OFFSET(INDEX('D.A. B'!$A$19:$A$47,MATCH(B101,'D.A. B'!$A$19:$A$47,0),1),0,12)=0,\"\",IF(LEN(OFFSET(INDEX('D.A. B'!$A$19:$A$47,MATCH(B101,'D.A. B'!$A$19:$A$47,0),1),0,12))>27,LEFT(OFFSET(INDEX('D.A. B'!$A$19:$A$47,MATCH(B101,'D.A. B'!$A$19:$A$47,0),1),0,12),27)&\"…\",OFFSET(INDEX('D.A. B'!$A$19:$A$47,MATCH(B101,'D.A. B'!$A$19:$A$47,0),1),0,12)))","v":""},null,null,null,""]
[null,"Sheet flow to Vegetated Filter Strip in C/D Soils",{"$f":"SUMIFS('D.A. B'!$B$19:$B$47,'D.A. B'!$A$19:$A$47,B102,'D.A. B'!$B$19:$B$47,\">0\")+SUMIFS('D.A. B'!$C$19:$C$47,'D.A. B'!$A$19:$A$47,B102,'D.A. B'!$C$19:$C$47,\">0\")","v":0},{"$f":"SUMIFS('D.A. B'!$K$19:$K$47,'D.A. B'!$A$19:$A$47,B102,'D.A. B'!$K$19:$K$47,\">0\")","v":0},{"$f":"IF(OFFSET(INDEX('D.A. B'!$A$19:$A$47,MATCH(B102,'D.A. B'!$A$19:$A$47,0),1),0,12)=0,\"\",IF(LEN(OFFSET(INDEX('D.A. B'!$A$19:$A$47,MATCH(B102,'D.A. B'!$A$19:$A$47,0),1),0,12))>27,LEFT(OFFSET(INDEX('D.A. B'!$A$19:$A$47,MATCH(B102,'D.A. B'!$A$19:$A$47,0),1),0,12),27)&\"…\",OFFSET(INDEX('D.A. B'!$A$19:$A$47,MATCH(B102,'D.A. B'!$A$19:$A$47,0),1),0,12)))","v":""},null,null,null,""]
[null,null,null,null,null,null,null,null,{"$f":"IF(SUM($D$24:$D$26)<>0,1,\"\")","v":""}]
[null,"Total Impervious Cover Treated (acres)",{"$f":"'D.A. B'!B48","v":0},null,null,null,null,null,{"$f":"IF(SUM($D$24:$D$26)<>0,1,\"\")","v":""}]
[null,"Total Turf Area Treated (acres) ",{"$f":"'D.A. B'!C48","v":0},null,null,null,null,null,{"$f":"IF(SUM($D$24:$D$26)<>0,1,\"\")","v":""}]
[]
[]
[null,"Drainage Area C Summary",null,null,null,null,null,null,{"$f":"IF(SUM($E$24:$E$26)<>0,1,\"\")","v":""}]
[null,null,null,null,null,null,null,null,{"$f":"IF(SUM($E$24:$E$26)<>0,1,\"\")","v":""}]
[null,"Land Cover Summary",null,null,null,null,null,null,""]
[null,null,null,null,null,null,null,null,""]
[null,null,"A Soils","B Soils","C Soils","D Soils","Total","% of Total",""]
[null,"Forest (acres)",{"$f":"'Site Data'!B31","v":0},{"$f":"'Site Data'!C31","v":0},{"$f":"'Site Data'!D31","v":0},{"$f":"'Site Data'!E31","v":0},{"$f":"'Site Data'!F31","v":0},{"$f":"IF(G$38>0,G113/G$38*100,0)","v":0},""]
[null,"Turf (acres)",{"$f":"'Site Data'!B32","v":0},{"$f":"'Site Data'!C32","v":0},{"$f":"'Site Data'!D32","v":0},{"$f":"'Site Data'!E32","v":0},{"$f":"'Site Data'!F32","v":0},{"$f":"IF(G$38>0,G114/G$38*100,0)","v":0},""]
[null,"Impervious (acres)",{"$f":"'Site Data'!B33","v":0},{"$f":"'Site Data'!C33","v":0},{"$f":"'Site Data'!D33","v":0},{"$f":"'Site Data'!E33","v":0},{"$f":"'Site Data'!F33","v":0},{"$f":"IF(G$38>0,G115/G$38*100,0)","v":0},""]
[null,null,null,null,null,null,{"$f":"SUM(G113:G115)","v":0},null,""]
[null,null,null,null,null,null,null,null,""]
[null,"BMP Selections",null,null,null,null,null,null,""]
[null,null,null,null,null,null,null,null,""]
[null,{"$f":"IF(SUM(I121:I141)>0,\"Practice\",\"No Practices in this Drainage Area\")","v":"No Practices in this Drainage Area"},"Credit Area (acres)","Runoff Reduction (ft3)","Downstream Practice",null,null,null,""]
[null,"Vegetated Roof",{"$f":"SUMIFS('D.A. C'!$B$19:$B$47,'D.A. C'!$A$19:$A$47,B121,'D.A. C'!$B$19:$B$47,\">0\")+SUMIFS('D.A. C'!$C$19:$C$47,'D.A. C'!$A$19:$A$47,B121,'D.A. C'!$C$19:$C$47,\">0\")","v":0},{"$f":"SUMIFS('D.A. C'!$K$19:$K$47,'D.A. C'!$A$19:$A$47,B121,'D.A. C'!$K$19:$K$47,\">0\")","v":0},{"$f":"IF(OFFSET(INDEX('D.A. C'!$A$19:$A$47,MATCH(B121,'D.A. C'!$A$19:$A$47,0),1),0,12)=0,\"\",IF(LEN(OFFSET(INDEX('D.A. C'!$A$19:$A$47,MATCH(B121,'D.A. C'!$A$19:$A$47,0),1),0,12))>27,LEFT(OFFSET(INDEX('D.A. C'!$A$19:$A$47,MATCH(B121,'D.A. C'!$A$19:$A$47,0),1),0,12),27)&\"…\",OFFSET(INDEX('D.A. C'!$A$19:$A$47,MATCH(B121,'D.A. C'!$A$19:$A$47,0),1),0,12)))","v":""},null,null,null,{"$f":"IF(AND(D121>0,SUM($E$24:$E$26)>0),1,\"\")","v":""}]
[null,"Simple Disconnection to A/B Soils or Soil-Amended Filter Path in C/D Soils (4.2.2, Appendix D)",{"$f":"SUMIFS('D.A. C'!$B$19:$B$47,'D.A. C'!$A$19:$A$47,B122,'D.A. C'!$B$19:$B$47,\">0\")+SUMIFS('D.A. C'!$C$19:$C$47,'D.A. C'!$A$19:$A$47,B122,'D.A. C'!$C$19:$C$47,\">0\")","v":0},{"$f":"SUMIFS('D.A. C'!$K$19:$K$47,'D.A. C'!$A$19:$A$47,B122,'D.A. C'!$K$19:$K$47,\">0\")","v":0},{"$f":"IF(OFFSET(INDEX('D.A. C'!$A$19:$A$47,MATCH(B122,'D.A. C'!$A$19:$A$47,0),1),0,12)=0,\"\",IF(LEN(OFFSET(INDEX('D.A. C'!$A$19:$A$47,MATCH(B122,'D.A. C'!$A$19:$A$47,0),1),0,12))>27,LEFT(OFFSET(INDEX('D.A. C'!$A$19:$A$47,MATCH(B122,'D.A. C'!$A$19:$A$47,0),1),0,12),27)&\"…\",OFFSET(INDEX('D.A. C'!$A$19:$A$47,MATCH(B122,'D.A. C'!$A$19:$A$47,0),1),0,12)))","v":""},null,null,null,{"$f":"IF(AND(D122>0,SUM($E$24:$E$26)>0),1,\"\")","v":""}]
[null,"Simple Disconnection to C/D Soils (4.2.2)",{"$f":"SUMIFS('D.A. C'!$B$19:$B$47,'D.A. C'!$A$19:$A$47,B123,'D.A. C'!$B$19:$B$47,\">0\")+SUMIFS('D.A. C'!$C$19:$C$47,'D.A. C'!$A$19:$A$47,B123,'D.A. C'!$C$19:$C$47,\">0\")","v":0},{"$f":"SUMIFS('D.A. C'!$K$19:$K$47,'D.A. C'!$A$19:$A$47,B123,'D.A. C'!$K$19:$K$47,\">0\")","v":0},{"$f":"IF(OFFSET(INDEX('D.A. C'!$A$19:$A$47,MATCH(B123,'D.A. C'!$A$19:$A$47,0),1),0,12)=0,\"\",IF(LEN(OFFSET(INDEX('D.A. C'!$A$19:$A$47,MATCH(B123,'D.A. C'!$A$19:$A$47,0),1),0,12))>27,LEFT(OFFSET(INDEX('D.A. C'!$A$19:$A$47,MATCH(B123,'D.A. C'!$A$19:$A$47,0),1),0,12),27)&\"…\",OFFSET(INDEX('D.A. C'!$A$19:$A$47,MATCH(B123,'D.A. C'!$A$19:$A$47,0),1),0,12)))","v":""},null,null,null,""]
[null,"To Residential Rain Garden (4.2.3.C)",{"$f":"SUMIFS('D.A. C'!$B$19:$B$47,'D.A. C'!$A$19:$A$47,B124,'D.A. C'!$B$19:$B$47,\">0\")+SUMIFS('D.A. C'!$C$19:$C$47,'D.A. C'!$A$19:$A$47,B124,'D.A. C'!$C$19:$C$47,\">0\")","v":0},{"$f":"SUMIFS('D.A. C'!$K$19:$K$47,'D.A. C'!$A$19:$A$47,B124,'D.A. C'!$K$19:$K$47,\">0\")","v":0},{"$f":"IF(OFFSET(INDEX('D.A. C'!$A$19:$A$47,MATCH(B124,'D.A. C'!$A$19:$A$47,0),1),0,12)=0,\"\",IF(LEN(OFFSET(INDEX('D.A. C'!$A$19:$A$47,MATCH(B124,'D.A. C'!$A$19:$A$47,0),1),0,12))>27,LEFT(OFFSET(INDEX('D.A. C'!$A$19:$A$47,MATCH(B124,'D.A. C'!$A$19:$A$47,0),1),0,12),27)&\"…\",OFFSET(INDEX('D.A. C'!$A$19:$A$47,MATCH(B124,'D.A. C'!$A$19:$A$47,0),1),0,12)))","v":""},null,null,null,""]
[null,"To Rainwater Harvesting (4.2.8)",{"$f":"SUMIFS('D.A. C'!$B$19:$B$47,'D.A. C'!$A$19:$A$47,B125,'D.A. C'!$B$19:$B$47,\">0\")+SUMIFS('D.A. C'!$C$19:$C$47,'D.A. C'!$A$19:$A$47,B125,'D.A. C'!$C$19:$C$47,\">0\")","v":0},{"$f":"SUMIFS('D.A. C'!$K$19:$K$47,'D.A. C'!$A$19:$A$47,B125,'D.A. C'!$K$19:$K$47,\">0\")","v":0},{"$f":"IF(OFFSET(INDEX('D.A. C'!$A$19:$A$47,MATCH(B125,'D.A. C'!$A$19:$A$47,0),1),0,12)=0,\"\",IF(LEN(OFFSET(INDEX('D.A. C'!$A$19:$A$47,MATCH(B125,'D.A. C'!$A$19:$A$47,0),1),0,12))>27,LEFT(OFFSET(INDEX('D.A. C'!$A$19:$A$47,MATCH(B125,'D.A. C'!$A$19:$A$47,0),1),0,12),27)&\"…\",OFFSET(INDEX('D.A. C'!$A$19:$A$47,MATCH(B125,'D.A. C'!$A$19:$A$47,0),1),0,12)))","v":""},null,null,null,""]
[null,"Permeable Pavement, Level 1",{"$f":"SUMIFS('D.A. C'!$B$19:$B$47,'D.A. C'!$A$19:$A$47,B126,'D.A. C'!$B$19:$B$47,\">0\")+SUMIFS('D.A. C'!$C$19:$C$47,'D.A. C'!$A$19:$A$47,B126,'D.A. C'!$C$19:$C$47,\">0\")","v":0},{"$f":"SUMIFS('D.A. C'!$K$19:$K$47,'D.A. C'!$A$19:$A$47,B126,'D.A. C'!$K$19:$K$47,\">0\")","v":0},{"$f":"IF(OFFSET(INDEX('D.A. C'!$A$19:$A$47,MATCH(B126,'D.A. C'!$A$19:$A$47,0),1),0,12)=0,\"\",IF(LEN(OFFSET(INDEX('D.A. C'!$A$19:$A$47,MATCH(B126,'D.A. C'!$A$19:$A$47,0),1),0,12))>27,LEFT(OFFSET(INDEX('D.A. C'!$A$19:$A$47,MATCH(B126,'D.A. C'!$A$19:$A$47,0),1),0,12),27)&\"…\",OFFSET(INDEX('D.A. C'!$A$19:$A$47,MATCH(B126,'D.A. C'!$A$19:$A$47,0),1),0,12)))","v":""},null,null,null,""]
[null,"Permeable Pavement, Level 2 (infiltration)",{"$f":"SUMIFS('D.A. C'!$B$19:$B$47,'D.A. C'!$A$19:$A$47,B127,'D.A. C'!$B$19:$B$47,\">0\")+SUMIFS('D.A. C'!$C$19:$C$47,'D.A. C'!$A$19:$A$47,B127,'D.A. C'!$C$19:$C$47,\">0\")","v":0},{"$f":"SUMIFS('D.A. C'!$K$19:$K$47,'D.A. C'!$A$19:$A$47,B127,'D.A. C'!$K$19:$K$47,\">0\")","v":0},{"$f":"IF(OFFSET(INDEX('D.A. C'!$A$19:$A$47,MATCH(B127,'D.A. C'!$A$19:$A$47,0),1),0,12)=0,\"\",IF(LEN(OFFSET(INDEX('D.A. C'!$A$19:$A$47,MATCH(B127,'D.A. C'!$A$19:$A$47,0),1),0,12))>27,LEFT(OFFSET(INDEX('D.A. C'!$A$19:$A$47,MATCH(B127,'D.A. C'!$A$19:$A$47,0),1),0,12),27)&\"…\",OFFSET(INDEX('D.A. C'!$A$19:$A$47,MATCH(B127,'D.A. C'!$A$19:$A$47,0),1),0,12)))","v":""},null,null,null,""]
[null,"Permeable Pavement, Level 2 (infiltration & underdrain)",{"$f":"SUMIFS('D.A. C'!$B$19:$B$47,'D.A. C'!$A$19:$A$47,B128,'D.A. C'!$B$19:$B$47,\">0\")+SUMIFS('D.A. C'!$C$19:$C$47,'D.A. C'!$A$19:$A$47,B128,'D.A. C'!$C$19:$C$47,\">0\")","v":0},{"$f":"SUMIFS('D.A. C'!$K$19:$K$47,'D.A. C'!$A$19:$A$47,B128,'D.A. C'!$K$19:$K$47,\">0\")","v":0},{"$f":"IF(OFFSET(INDEX('D.A. C'!$A$19:$A$47,MATCH(B128,'D.A. C'!$A$19:$A$47,0),1),0,12)=0,\"\",IF(LEN(OFFSET(INDEX('D.A. C'!$A$19:$A$47,MATCH(B128,'D.A. C'!$A$19:$A$47,0),1),0,12))>27,LEFT(OFFSET(INDEX('D.A. C'!$A$19:$A$47,MATCH(B128,'D.A. C'!$A$19:$A$47,0),1),0,12),27)&\"…\",OFFSET(INDEX('D.A. C'!$A$19:$A$47,MATCH(B128,'D.A. C'!$A$19:$A$47,0),1),0,12)))","v":""},null,null,null,""]
[null,"Grass Swale A/B Soils",{"$f":"SUMIFS('D.A. C'!$B$19:$B$47,'D.A. C'!$A$19:$A$47,B129,'D.A. C'!$B$19:$B$47,\">0\")+SUMIFS('D.A. C'!$C$19:$C$47,'D.A. C'!$A$19:$A$47,B129,'D.A. C'!$C$19:$C$47,\">0\")","v":0},{"$f":"SUMIFS('D.A. C'!$K$19:$K$47,'D.A. C'!$A$19:$A$47,B129,'D.A. C'!$K$19:$K$47,\">0\")","v":0},{"$f":"IF(OFFSET(INDEX('D.A. C'!$A$19:$A$47,MATCH(B129,'D.A. C'!$A$19:$A$47,0),1),0,12)=0,\"\",IF(LEN(OFFSET(INDEX('D.A. C'!$A$19:$A$47,MATCH(B129,'D.A. C'!$A$19:$A$47,0),1),0,12))>27,LEFT(OFFSET(INDEX('D.A. C'!$A$19:$A$47,MATCH(B129,'D.A. C'!$A$19:$A$47,0),1),0,12),27)&\"…\",OFFSET(INDEX('D.A. C'!$A$19:$A$47,MATCH(B129,'D.A. C'!$A$19:$A$47,0),1),0,12)))","v":""},null,null,null,""]
[null,"Grass Swale C/D Soils",{"$f":"SUMIFS('D.A. C'!$B$19:$B$47,'D.A. C'!$A$19:$A$47,B130,'D.A. C'!$B$19:$B$47,\">0\")+SUMIFS('D.A. C'!$C$19:$C$47,'D.A. C'!$A$19:$A$47,B130,'D.A. C'!$C$19:$C$47,\">0\")","v":0},{"$f":"SUMIFS('D.A. C'!$K$19:$K$47,'D.A. C'!$A$19:$A$47,B130,'D.A. C'!$K$19:$K$47,\">0\")","v":0},{"$f":"IF(OFFSET(INDEX('D.A. C'!$A$19:$A$47,MATCH(B130,'D.A. C'!$A$19:$A$47,0),1),0,12)=0,\"\",IF(LEN(OFFSET(INDEX('D.A. C'!$A$19:$A$47,MATCH(B130,'D.A. C'!$A$19:$A$47,0),1),0,12))>27,LEFT(OFFSET(INDEX('D.A. C'!$A$19:$A$47,MATCH(B130,'D.A. C'!$A$19:$A$47,0),1),0,12),27)&\"…\",OFFSET(INDEX('D.A. C'!$A$19:$A$47,MATCH(B130,'D.A. C'!$A$19:$A$47,0),1),0,12)))","v":""},null,null,null,""]
[null,"Grass Swale in C/D Soil with Soil Amendments",{"$f":"SUMIFS('D.A. C'!$B$19:$B$47,'D.A. C'!$A$19:$A$47,B131,'D.A. C'!$B$19:$B$47,\">0\")+SUMIFS('D.A. C'!$C$19:$C$47,'D.A. C'!$A$19:$A$47,B131,'D.A. C'!$C$19:$C$47,\">0\")","v":0},{"$f":"SUMIFS('D.A. C'!$K$19:$K$47,'D.A. C'!$A$19:$A$47,B131,'D.A. C'!$K$19:$K$47,\">0\")","v":0},{"$f":"IF(OFFSET(INDEX('D.A. C'!$A$19:$A$47,MATCH(B131,'D.A. C'!$A$19:$A$47,0),1),0,12)=0,\"\",IF(LEN(OFFSET(INDEX('D.A. C'!$A$19:$A$47,MATCH(B131,'D.A. C'!$A$19:$A$47,0),1),0,12))>27,LEFT(OFFSET(INDEX('D.A. C'!$A$19:$A$47,MATCH(B131,'D.A. C'!$A$19:$A$47,0),1),0,12),27)&\"…\",OFFSET(INDEX('D.A. C'!$A$19:$A$47,MATCH(B131,'D.A. C'!$A$19:$A$47,0),1),0,12)))","v":""},null,null,null,""]
[null,"Water Quality Swale, Level 1",{"$f":"SUMIFS('D.A. C'!$B$19:$B$47,'D.A. C'!$A$19:$A$47,B132,'D.A. C'!$B$19:$B$47,\">0\")+SUMIFS('D.A. C'!$C$19:$C$47,'D.A. C'!$A$19:$A$47,B132,'D.A. C'!$C$19:$C$47,\">0\")","v":0},{"$f":"SUMIFS('D.A. C'!$K$19:$K$47,'D.A. C'!$A$19:$A$47,B132,'D.A. C'!$K$19:$K$47,\">0\")","v":0},{"$f":"IF(OFFSET(INDEX('D.A. C'!$A$19:$A$47,MATCH(B132,'D.A. C'!$A$19:$A$47,0),1),0,12)=0,\"\",IF(LEN(OFFSET(INDEX('D.A. C'!$A$19:$A$47,MATCH(B132,'D.A. C'!$A$19:$A$47,0),1),0,12))>27,LEFT(OFFSET(INDEX('D.A. C'!$A$19:$A$47,MATCH(B132,'D.A. C'!$A$19:$A$47,0),1),0,12),27)&\"…\",OFFSET(INDEX('D.A. C'!$A$19:$A$47,MATCH(B132,'D.A. C'!$A$19:$A$47,0),1),0,12)))","v":""},null,null,null,""]
[null,"Water Quality Swale, Level 2",{"$f":"SUMIFS('D.A. C'!$B$19:$B$47,'D.A. C'!$A$19:$A$47,B133,'D.A. C'!$B$19:$B$47,\">0\")+SUMIFS('D.A. C'!$C$19:$C$47,'D.A. C'!$A$19:$A$47,B133,'D.A. C'!$C$19:$C$47,\">0\")","v":0},{"$f":"SUMIFS('D.A. C'!$K$19:$K$47,'D.A. C'!$A$19:$A$47,B133,'D.A. C'!$K$19:$K$47,\">0\")","v":0},{"$f":"IF(OFFSET(INDEX('D.A. C'!$A$19:$A$47,MATCH(B133,'D.A. C'!$A$19:$A$47,0),1),0,12)=0,\"\",IF(LEN(OFFSET(INDEX('D.A. C'!$A$19:$A$47,MATCH(B133,'D.A. C'!$A$19:$A$47,0),1),0,12))>27,LEFT(OFFSET(INDEX('D.A. C'!$A$19:$A$47,MATCH(B133,'D.A. C'!$A$19:$A$47,0),1),0,12),27)&\"…\",OFFSET(INDEX('D.A. C'!$A$19:$A$47,MATCH(B133,'D.A. C'!$A$19:$A$47,0),1),0,12)))","v":""},null,null,null,""]
[null,"Bioretention, Level 1 or Urban Bioretention (4.2.3.B)",{"$f":"SUMIFS('D.A. C'!$B$19:$B$47,'D.A. C'!$A$19:$A$47,B134,'D.A. C'!$B$19:$B$47,\">0\")+SUMIFS('D.A. C'!$C$19:$C$47,'D.A. C'!$A$19:$A$47,B134,'D.A. C'!$C$19:$C$47,\">0\")","v":0},{"$f":"SUMIFS('D.A. C'!$K$19:$K$47,'D.A. C'!$A$19:$A$47,B134,'D.A. C'!$K$19:$K$47,\">0\")","v":0},{"$f":"IF(OFFSET(INDEX('D.A. C'!$A$19:$A$47,MATCH(B134,'D.A. C'!$A$19:$A$47,0),1),0,12)=0,\"\",IF(LEN(OFFSET(INDEX('D.A. C'!$A$19:$A$47,MATCH(B134,'D.A. C'!$A$19:$A$47,0),1),0,12))>27,LEFT(OFFSET(INDEX('D.A. C'!$A$19:$A$47,MATCH(B134,'D.A. C'!$A$19:$A$47,0),1),0,12),27)&\"…\",OFFSET(INDEX('D.A. C'!$A$19:$A$47,MATCH(B134,'D.A. C'!$A$19:$A$47,0),1),0,12)))","v":""},null,null,null,""]
[null,"Bioretention, Level 2",{"$f":"SUMIFS('D.A. C'!$B$19:$B$47,'D.A. C'!$A$19:$A$47,B135,'D.A. C'!$B$19:$B$47,\">0\")+SUMIFS('D.A. C'!$C$19:$C$47,'D.A. C'!$A$19:$A$47,B135,'D.A. C'!$C$19:$C$47,\">0\")","v":0},{"$f":"SUMIFS('D.A. C'!$K$19:$K$47,'D.A. C'!$A$19:$A$47,B135,'D.A. C'!$K$19:$K$47,\">0\")","v":0},{"$f":"IF(OFFSET(INDEX('D.A. C'!$A$19:$A$47,MATCH(B135,'D.A. C'!$A$19:$A$47,0),1),0,12)=0,\"\",IF(LEN(OFFSET(INDEX('D.A. C'!$A$19:$A$47,MATCH(B135,'D.A. C'!$A$19:$A$47,0),1),0,12))>27,LEFT(OFFSET(INDEX('D.A. C'!$A$19:$A$47,MATCH(B135,'D.A. C'!$A$19:$A$47,0),1),0,12),27)&\"…\",OFFSET(INDEX('D.A. C'!$A$19:$A$47,MATCH(B135,'D.A. C'!$A$19:$A$47,0),1),0,12)))","v":""},null,null,null,""]
[null,"Infiltration",{"$f":"SUMIFS('D.A. C'!$B$19:$B$47,'D.A. C'!$A$19:$A$47,B136,'D.A. C'!$B$19:$B$47,\">0\")+SUMIFS('D.A. C'!$C$19:$C$47,'D.A. C'!$A$19:$A$47,B136,'D.A. C'!$C$19:$C$47,\">0\")","v":0},{"$f":"SUMIFS('D.A. C'!$K$19:$K$47,'D.A. C'!$A$19:$A$47,B136,'D.A. C'!$K$19:$K$47,\">0\")","v":0},{"$f":"IF(OFFSET(INDEX('D.A. C'!$A$19:$A$47,MATCH(B136,'D.A. C'!$A$19:$A$47,0),1),0,12)=0,\"\",IF(LEN(OFFSET(INDEX('D.A. C'!$A$19:$A$47,MATCH(B136,'D.A. C'!$A$19:$A$47,0),1),0,12))>27,LEFT(OFFSET(INDEX('D.A. C'!$A$19:$A$47,MATCH(B136,'D.A. C'!$A$19:$A$47,0),1),0,12),27)&\"…\",OFFSET(INDEX('D.A. C'!$A$19:$A$47,MATCH(B136,'D.A. C'!$A$19:$A$47,0),1),0,12)))","v":""},null,null,null,""]
[null,"*Filtration Practice/Stormwater Wetland do NOT receive runoff reduction values, but do have associated pollutant removal values",{"$f":"SUMIFS('D.A. C'!$B$19:$B$47,'D.A. C'!$A$19:$A$47,B137,'D.A. C'!$B$19:$B$47,\">0\")+SUMIFS('D.A. C'!$C$19:$C$47,'D.A. C'!$A$19:$A$47,B137,'D.A. C'!$C$19:$C$47,\">0\")","v":0},{"$f":"SUMIFS('D.A. C'!$K$19:$K$47,'D.A. C'!$A$19:$A$47,B137,'D.A. C'!$K$19:$K$47,\">0\")","v":0},{"$f":"IF(OFFSET(INDEX('D.A. C'!$A$19:$A$47,MATCH(B137,'D.A. C'!$A$19:$A$47,0),1),0,12)=0,\"\",IF(LEN(OFFSET(INDEX('D.A. C'!$A$19:$A$47,MATCH(B137,'D.A. C'!$A$19:$A$47,0),1),0,12))>27,LEFT(OFFSET(INDEX('D.A. C'!$A$19:$A$47,MATCH(B137,'D.A. C'!$A$19:$A$47,0),1),0,12),27)&\"…\",OFFSET(INDEX('D.A. C'!$A$19:$A$47,MATCH(B137,'D.A. C'!$A$19:$A$47,0),1),0,12)))","v":""},null,null,null,""]
[null,"Sheetflow to Conservation Area with A/B Soils",{"$f":"SUMIFS('D.A. C'!$B$19:$B$47,'D.A. C'!$A$19:$A$47,B138,'D.A. C'!$B$19:$B$47,\">0\")+SUMIFS('D.A. C'!$C$19:$C$47,'D.A. C'!$A$19:$A$47,B138,'D.A. C'!$C$19:$C$47,\">0\")","v":0},{"$f":"SUMIFS('D.A. C'!$K$19:$K$47,'D.A. C'!$A$19:$A$47,B138,'D.A. C'!$K$19:$K$47,\">0\")","v":0},{"$f":"IF(OFFSET(INDEX('D.A. C'!$A$19:$A$47,MATCH(B138,'D.A. C'!$A$19:$A$47,0),1),0,12)=0,\"\",IF(LEN(OFFSET(INDEX('D.A. C'!$A$19:$A$47,MATCH(B138,'D.A. C'!$A$19:$A$47,0),1),0,12))>27,LEFT(OFFSET(INDEX('D.A. C'!$A$19:$A$47,MATCH(B138,'D.A. C'!$A$19:$A$47,0),1),0,12),27)&\"…\",OFFSET(INDEX('D.A. C'!$A$19:$A$47,MATCH(B138,'D.A. C'!$A$19:$A$47,0),1),0,12)))","v":""},null,null,null,""]
[null,"Sheetflow to Conservation Area with C/D Soils",{"$f":"SUMIFS('D.A. C'!$B$19:$B$47,'D.A. C'!$A$19:$A$47,B139,'D.A. C'!$B$19:$B$47,\">0\")+SUMIFS('D.A. C'!$C$19:$C$47,'D.A. C'!$A$19:$A$47,B139,'D.A. C'!$C$19:$C$47,\">0\")","v":0},{"$f":"SUMIFS('D.A. C'!$K$19:$K$47,'D.A. C'!$A$19:$A$47,B139,'D.A. C'!$K$19:$K$47,\">0\")","v":0},{"$f":"IF(OFFSET(INDEX('D.A. C'!$A$19:$A$47,MATCH(B139,'D.A. C'!$A$19:$A$47,0),1),0,12)=0,\"\",IF(LEN(OFFSET(INDEX('D.A. C'!$A$19:$A$47,MATCH(B139,'D.A. C'!$A$19:$A$47,0),1),0,12))>27,LEFT(OFFSET(INDEX('D.A. C'!$A$19:$A$47,MATCH(B139,'D.A. C'!$A$19:$A$47,0),1),0,12),27)&\"…\",OFFSET(INDEX('D.A. C'!$A$19:$A$47,MATCH(B139,'D.A. C'!$A$19:$A$47,0),1),0,12)))","v":""},null,null,null,""]
[null,"Sheetflow to Vegetated Filter Strip in A/B Soils or Compost Amended C/D Soils",{"$f":"SUMIFS('D.A. C'!$B$19:$B$47,'D.A. C'!$A$19:$A$47,B140,'D.A. C'!$B$19:$B$47,\">0\")+SUMIFS('D.A. C'!$C$19:$C$47,'D.A. C'!$A$19:$A$47,B140,'D.A. C'!$C$19:$C$47,\">0\")","v":0},{"$f":"SUMIFS('D.A. C'!$K$19:$K$47,'D.A. C'!$A$19:$A$47,B140,'D.A. C'!$K$19:$K$47,\">0\")","v":0},{"$f":"IF(OFFSET(INDEX('D.A. C'!$A$19:$A$47,MATCH(B140,'D.A. C'!$A$19:$A$47,0),1),0,12)=0,\"\",IF(LEN(OFFSET(INDEX('D.A. C'!$A$19:$A$47,MATCH(B140,'D.A. C'!$A$19:$A$47,0),1),0,12))>27,LEFT(OFFSET(INDEX('D.A. C'!$A$19:$A$47,MATCH(B140,'D.A. C'!$A$19:$A$47,0),1),0,12),27)&\"…\",OFFSET(INDEX('D.A. C'!$A$19:$A$47,MATCH(B140,'D.A. C'!$A$19:$A$47,0),1),0,12)))","v":""},null,null,null,""]
[null,"Sheet flow to Vegetated Filter Strip in C/D Soils",{"$f":"SUMIFS('D.A. C'!$B$19:$B$47,'D.A. C'!$A$19:$A$47,B141,'D.A. C'!$B$19:$B$47,\">0\")+SUMIFS('D.A. C'!$C$19:$C$47,'D.A. C'!$A$19:$A$47,B141,'D.A. C'!$C$19:$C$47,\">0\")","v":0},{"$f":"SUMIFS('D.A. C'!$K$19:$K$47,'D.A. C'!$A$19:$A$47,B141,'D.A. C'!$K$19:$K$47,\">0\")","v":0},{"$f":"IF(OFFSET(INDEX('D.A. C'!$A$19:$A$47,MATCH(B141,'D.A. C'!$A$19:$A$47,0),1),0,12)=0,\"\",IF(LEN(OFFSET(INDEX('D.A. C'!$A$19:$A$47,MATCH(B141,'D.A. C'!$A$19:$A$47,0),1),0,12))>27,LEFT(OFFSET(INDEX('D.A. C'!$A$19:$A$47,MATCH(B141,'D.A. C'!$A$19:$A$47,0),1),0,12),27)&\"…\",OFFSET(INDEX('D.A. C'!$A$19:$A$47,MATCH(B141,'D.A. C'!$A$19:$A$47,0),1),0,12)))","v":""},null,null,null,""]
[null,null,null,null,null,null,null,null,{"$f":"IF(SUM($E$24:$E$26)<>0,1,\"\")","v":""}]
[null,"Total Impervious Cover Treated (acres)",{"$f":"'D.A. C'!B48","v":0},null,null,null,null,null,{"$f":"IF(SUM($E$24:$E$26)<>0,1,\"\")","v":""}]
[null,"Total Turf Area Treated (acres) ",{"$f":"'D.A. C'!C48","v":0},null,null,null,null,null,{"$f":"IF(SUM($E$24:$E$26)<>0,1,\"\")","v":""}]
[]
[]
[null,"Drainage Area D Summary",null,null,null,null,null,null,{"$f":"IF(SUM($F$24:$F$26)<>0,1,\"\")","v":""}]
[null,null,null,null,null,null,null,null,{"$f":"IF(SUM($F$24:$F$26)<>0,1,\"\")","v":""}]
[null,"Land Cover Summary",null,null,null,null,null,null,""]
[null,null,null,null,null,null,null,null,""]
[null,null,"A Soils","B Soils","C Soils","D Soils","Total","% of Total",""]
[null,"Forest (acres)",{"$f":"'Site Data'!B38","v":0},{"$f":"'Site Data'!C38","v":0},{"$f":"'Site Data'!D38","v":0},{"$f":"'Site Data'!E38","v":0},{"$f":"'Site Data'!F38","v":0},{"$f":"IF(G$38>0,G152/G$38*100,0)","v":0},""]
[null,"Turf (acres)",{"$f":"'Site Data'!B39","v":0},{"$f":"'Site Data'!C39","v":0},{"$f":"'Site Data'!D39","v":0},{"$f":"'Site Data'!E39","v":0},{"$f":"'Site Data'!F39","v":0},{"$f":"IF(G$38>0,G153/G$38*100,0)","v":0},""]
[null,"Impervious (acres)",{"$f":"'Site Data'!B40","v":0},{"$f":"'Site Data'!C40","v":0},{"$f":"'Site Data'!D40","v":0},{"$f":"'Site Data'!E40","v":0},{"$f":"'Site Data'!F40","v":0},{"$f":"IF(G$38>0,G154/G$38*100,0)","v":0},""]
[null,null,null,null,null,null,{"$f":"SUM(G152:G154)","v":0},null,""]
[null,null,null,null,null,null,null,null,""]
[null,"BMP Selections",null,null,null,null,null,null,""]
[null,null,null,null,null,null,null,null,""]
[null,{"$f":"IF(SUM(I160:I180)>0,\"Practice\",\"No Practices in this Drainage Area\")","v":"No Practices in this Drainage Area"},"Credit Area (acres)","Runoff Reduction (ft3)","Downstream Practice",null,null,null,""]
[null,"Vegetated Roof",{"$f":"SUMIFS('D.A. D'!$B$19:$B$47,'D.A. D'!$A$19:$A$47,B160,'D.A. D'!$B$19:$B$47,\">0\")+SUMIFS('D.A. D'!$C$19:$C$47,'D.A. D'!$A$19:$A$47,B160,'D.A. D'!$C$19:$C$47,\">0\")","v":0},{"$f":"SUMIFS('D.A. D'!$K$19:$K$47,'D.A. D'!$A$19:$A$47,B160,'D.A. D'!$K$19:$K$47,\">0\")","v":0},{"$f":"IF(OFFSET(INDEX('D.A. D'!$A$19:$A$47,MATCH(B160,'D.A. D'!$A$19:$A$47,0),1),0,12)=0,\"\",IF(LEN(OFFSET(INDEX('D.A. D'!$A$19:$A$47,MATCH(B160,'D.A. D'!$A$19:$A$47,0),1),0,12))>27,LEFT(OFFSET(INDEX('D.A. D'!$A$19:$A$47,MATCH(B160,'D.A. D'!$A$19:$A$47,0),1),0,12),27)&\"…\",OFFSET(INDEX('D.A. D'!$A$19:$A$47,MATCH(B160,'D.A. D'!$A$19:$A$47,0),1),0,12)))","v":""},null,null,null,{"$f":"IF(AND(D160>0,SUM($F$24:$F$26)>0),1,\"\")","v":""}]
[null,"Simple Disconnection to A/B Soils or Soil-Amended Filter Path in C/D Soils (4.2.2, Appendix D)",{"$f":"SUMIFS('D.A. D'!$B$19:$B$47,'D.A. D'!$A$19:$A$47,B161,'D.A. D'!$B$19:$B$47,\">0\")+SUMIFS('D.A. D'!$C$19:$C$47,'D.A. D'!$A$19:$A$47,B161,'D.A. D'!$C$19:$C$47,\">0\")","v":0},{"$f":"SUMIFS('D.A. D'!$K$19:$K$47,'D.A. D'!$A$19:$A$47,B161,'D.A. D'!$K$19:$K$47,\">0\")","v":0},{"$f":"IF(OFFSET(INDEX('D.A. D'!$A$19:$A$47,MATCH(B161,'D.A. D'!$A$19:$A$47,0),1),0,12)=0,\"\",IF(LEN(OFFSET(INDEX('D.A. D'!$A$19:$A$47,MATCH(B161,'D.A. D'!$A$19:$A$47,0),1),0,12))>27,LEFT(OFFSET(INDEX('D.A. D'!$A$19:$A$47,MATCH(B161,'D.A. D'!$A$19:$A$47,0),1),0,12),27)&\"…\",OFFSET(INDEX('D.A. D'!$A$19:$A$47,MATCH(B161,'D.A. D'!$A$19:$A$47,0),1),0,12)))","v":""},null,null,null,{"$f":"IF(AND(D161>0,SUM($F$24:$F$26)>0),1,\"\")","v":""}]
[null,"Simple Disconnection to C/D Soils (4.2.2)",{"$f":"SUMIFS('D.A. D'!$B$19:$B$47,'D.A. D'!$A$19:$A$47,B162,'D.A. D'!$B$19:$B$47,\">0\")+SUMIFS('D.A. D'!$C$19:$C$47,'D.A. D'!$A$19:$A$47,B162,'D.A. D'!$C$19:$C$47,\">0\")","v":0},{"$f":"SUMIFS('D.A. D'!$K$19:$K$47,'D.A. D'!$A$19:$A$47,B162,'D.A. D'!$K$19:$K$47,\">0\")","v":0},{"$f":"IF(OFFSET(INDEX('D.A. D'!$A$19:$A$47,MATCH(B162,'D.A. D'!$A$19:$A$47,0),1),0,12)=0,\"\",IF(LEN(OFFSET(INDEX('D.A. D'!$A$19:$A$47,MATCH(B162,'D.A. D'!$A$19:$A$47,0),1),0,12))>27,LEFT(OFFSET(INDEX('D.A. D'!$A$19:$A$47,MATCH(B162,'D.A. D'!$A$19:$A$47,0),1),0,12),27)&\"…\",OFFSET(INDEX('D.A. D'!$A$19:$A$47,MATCH(B162,'D.A. D'!$A$19:$A$47,0),1),0,12)))","v":""},null,null,null,""]
[null,"To Residential Rain Garden (4.2.3.C)",{"$f":"SUMIFS('D.A. D'!$B$19:$B$47,'D.A. D'!$A$19:$A$47,B163,'D.A. D'!$B$19:$B$47,\">0\")+SUMIFS('D.A. D'!$C$19:$C$47,'D.A. D'!$A$19:$A$47,B163,'D.A. D'!$C$19:$C$47,\">0\")","v":0},{"$f":"SUMIFS('D.A. D'!$K$19:$K$47,'D.A. D'!$A$19:$A$47,B163,'D.A. D'!$K$19:$K$47,\">0\")","v":0},{"$f":"IF(OFFSET(INDEX('D.A. D'!$A$19:$A$47,MATCH(B163,'D.A. D'!$A$19:$A$47,0),1),0,12)=0,\"\",IF(LEN(OFFSET(INDEX('D.A. D'!$A$19:$A$47,MATCH(B163,'D.A. D'!$A$19:$A$47,0),1),0,12))>27,LEFT(OFFSET(INDEX('D.A. D'!$A$19:$A$47,MATCH(B163,'D.A. D'!$A$19:$A$47,0),1),0,12),27)&\"…\",OFFSET(INDEX('D.A. D'!$A$19:$A$47,MATCH(B163,'D.A. D'!$A$19:$A$47,0),1),0,12)))","v":""},null,null,null,""]
[null,"To Rainwater Harvesting (4.2.8)",{"$f":"SUMIFS('D.A. D'!$B$19:$B$47,'D.A. D'!$A$19:$A$47,B164,'D.A. D'!$B$19:$B$47,\">0\")+SUMIFS('D.A. D'!$C$19:$C$47,'D.A. D'!$A$19:$A$47,B164,'D.A. D'!$C$19:$C$47,\">0\")","v":0},{"$f":"SUMIFS('D.A. D'!$K$19:$K$47,'D.A. D'!$A$19:$A$47,B164,'D.A. D'!$K$19:$K$47,\">0\")","v":0},{"$f":"IF(OFFSET(INDEX('D.A. D'!$A$19:$A$47,MATCH(B164,'D.A. D'!$A$19:$A$47,0),1),0,12)=0,\"\",IF(LEN(OFFSET(INDEX('D.A. D'!$A$19:$A$47,MATCH(B164,'D.A. D'!$A$19:$A$47,0),1),0,12))>27,LEFT(OFFSET(INDEX('D.A. D'!$A$19:$A$47,MATCH(B164,'D.A. D'!$A$19:$A$47,0),1),0,12),27)&\"…\",OFFSET(INDEX('D.A. D'!$A$19:$A$47,MATCH(B164,'D.A. D'!$A$19:$A$47,0),1),0,12)))","v":""},null,null,null,""]
[null,"Permeable Pavement, Level 1",{"$f":"SUMIFS('D.A. D'!$B$19:$B$47,'D.A. D'!$A$19:$A$47,B165,'D.A. D'!$B$19:$B$47,\">0\")+SUMIFS('D.A. D'!$C$19:$C$47,'D.A. D'!$A$19:$A$47,B165,'D.A. D'!$C$19:$C$47,\">0\")","v":0},{"$f":"SUMIFS('D.A. D'!$K$19:$K$47,'D.A. D'!$A$19:$A$47,B165,'D.A. D'!$K$19:$K$47,\">0\")","v":0},{"$f":"IF(OFFSET(INDEX('D.A. D'!$A$19:$A$47,MATCH(B165,'D.A. D'!$A$19:$A$47,0),1),0,12)=0,\"\",IF(LEN(OFFSET(INDEX('D.A. D'!$A$19:$A$47,MATCH(B165,'D.A. D'!$A$19:$A$47,0),1),0,12))>27,LEFT(OFFSET(INDEX('D.A. D'!$A$19:$A$47,MATCH(B165,'D.A. D'!$A$19:$A$47,0),1),0,12),27)&\"…\",OFFSET(INDEX('D.A. D'!$A$19:$A$47,MATCH(B165,'D.A. D'!$A$19:$A$47,0),1),0,12)))","v":""},null,null,null,""]
[null,"Permeable Pavement, Level 2 (infiltration)",{"$f":"SUMIFS('D.A. D'!$B$19:$B$47,'D.A. D'!$A$19:$A$47,B166,'D.A. D'!$B$19:$B$47,\">0\")+SUMIFS('D.A. D'!$C$19:$C$47,'D.A. D'!$A$19:$A$47,B166,'D.A. D'!$C$19:$C$47,\">0\")","v":0},{"$f":"SUMIFS('D.A. D'!$K$19:$K$47,'D.A. D'!$A$19:$A$47,B166,'D.A. D'!$K$19:$K$47,\">0\")","v":0},{"$f":"IF(OFFSET(INDEX('D.A. D'!$A$19:$A$47,MATCH(B166,'D.A. D'!$A$19:$A$47,0),1),0,12)=0,\"\",IF(LEN(OFFSET(INDEX('D.A. D'!$A$19:$A$47,MATCH(B166,'D.A. D'!$A$19:$A$47,0),1),0,12))>27,LEFT(OFFSET(INDEX('D.A. D'!$A$19:$A$47,MATCH(B166,'D.A. D'!$A$19:$A$47,0),1),0,12),27)&\"…\",OFFSET(INDEX('D.A. D'!$A$19:$A$47,MATCH(B166,'D.A. D'!$A$19:$A$47,0),1),0,12)))","v":""},null,null,null,""]
[null,"Permeable Pavement, Level 2 (infiltration & underdrain)",{"$f":"SUMIFS('D.A. D'!$B$19:$B$47,'D.A. D'!$A$19:$A$47,B167,'D.A. D'!$B$19:$B$47,\">0\")+SUMIFS('D.A. D'!$C$19:$C$47,'D.A. D'!$A$19:$A$47,B167,'D.A. D'!$C$19:$C$47,\">0\")","v":0},{"$f":"SUMIFS('D.A. D'!$K$19:$K$47,'D.A. D'!$A$19:$A$47,B167,'D.A. D'!$K$19:$K$47,\">0\")","v":0},{"$f":"IF(OFFSET(INDEX('D.A. D'!$A$19:$A$47,MATCH(B167,'D.A. D'!$A$19:$A$47,0),1),0,12)=0,\"\",IF(LEN(OFFSET(INDEX('D.A. D'!$A$19:$A$47,MATCH(B167,'D.A. D'!$A$19:$A$47,0),1),0,12))>27,LEFT(OFFSET(INDEX('D.A. D'!$A$19:$A$47,MATCH(B167,'D.A. D'!$A$19:$A$47,0),1),0,12),27)&\"…\",OFFSET(INDEX('D.A. D'!$A$19:$A$47,MATCH(B167,'D.A. D'!$A$19:$A$47,0),1),0,12)))","v":""},null,null,null,""]
[null,"Grass Swale A/B Soils",{"$f":"SUMIFS('D.A. D'!$B$19:$B$47,'D.A. D'!$A$19:$A$47,B168,'D.A. D'!$B$19:$B$47,\">0\")+SUMIFS('D.A. D'!$C$19:$C$47,'D.A. D'!$A$19:$A$47,B168,'D.A. D'!$C$19:$C$47,\">0\")","v":0},{"$f":"SUMIFS('D.A. D'!$K$19:$K$47,'D.A. D'!$A$19:$A$47,B168,'D.A. D'!$K$19:$K$47,\">0\")","v":0},{"$f":"IF(OFFSET(INDEX('D.A. D'!$A$19:$A$47,MATCH(B168,'D.A. D'!$A$19:$A$47,0),1),0,12)=0,\"\",IF(LEN(OFFSET(INDEX('D.A. D'!$A$19:$A$47,MATCH(B168,'D.A. D'!$A$19:$A$47,0),1),0,12))>27,LEFT(OFFSET(INDEX('D.A. D'!$A$19:$A$47,MATCH(B168,'D.A. D'!$A$19:$A$47,0),1),0,12),27)&\"…\",OFFSET(INDEX('D.A. D'!$A$19:$A$47,MATCH(B168,'D.A. D'!$A$19:$A$47,0),1),0,12)))","v":""},null,null,null,""]
[null,"Grass Swale C/D Soils",{"$f":"SUMIFS('D.A. D'!$B$19:$B$47,'D.A. D'!$A$19:$A$47,B169,'D.A. D'!$B$19:$B$47,\">0\")+SUMIFS('D.A. D'!$C$19:$C$47,'D.A. D'!$A$19:$A$47,B169,'D.A. D'!$C$19:$C$47,\">0\")","v":0},{"$f":"SUMIFS('D.A. D'!$K$19:$K$47,'D.A. D'!$A$19:$A$47,B169,'D.A. D'!$K$19:$K$47,\">0\")","v":0},{"$f":"IF(OFFSET(INDEX('D.A. D'!$A$19:$A$47,MATCH(B169,'D.A. D'!$A$19:$A$47,0),1),0,12)=0,\"\",IF(LEN(OFFSET(INDEX('D.A. D'!$A$19:$A$47,MATCH(B169,'D.A. D'!$A$19:$A$47,0),1),0,12))>27,LEFT(OFFSET(INDEX('D.A. D'!$A$19:$A$47,MATCH(B169,'D.A. D'!$A$19:$A$47,0),1),0,12),27)&\"…\",OFFSET(INDEX('D.A. D'!$A$19:$A$47,MATCH(B169,'D.A. D'!$A$19:$A$47,0),1),0,12)))","v":""},null,null,null,""]
[null,"Grass Swale in C/D Soil with Soil Amendments",{"$f":"SUMIFS('D.A. D'!$B$19:$B$47,'D.A. D'!$A$19:$A$47,B170,'D.A. D'!$B$19:$B$47,\">0\")+SUMIFS('D.A. D'!$C$19:$C$47,'D.A. D'!$A$19:$A$47,B170,'D.A. D'!$C$19:$C$47,\">0\")","v":0},{"$f":"SUMIFS('D.A. D'!$K$19:$K$47,'D.A. D'!$A$19:$A$47,B170,'D.A. D'!$K$19:$K$47,\">0\")","v":0},{"$f":"IF(OFFSET(INDEX('D.A. D'!$A$19:$A$47,MATCH(B170,'D.A. D'!$A$19:$A$47,0),1),0,12)=0,\"\",IF(LEN(OFFSET(INDEX('D.A. D'!$A$19:$A$47,MATCH(B170,'D.A. D'!$A$19:$A$47,0),1),0,12))>27,LEFT(OFFSET(INDEX('D.A. D'!$A$19:$A$47,MATCH(B170,'D.A. D'!$A$19:$A$47,0),1),0,12),27)&\"…\",OFFSET(INDEX('D.A. D'!$A$19:$A$47,MATCH(B170,'D.A. D'!$A$19:$A$47,0),1),0,12)))","v":""},null,null,null,""]
[null,"Water Quality Swale, Level 1",{"$f":"SUMIFS('D.A. D'!$B$19:$B$47,'D.A. D'!$A$19:$A$47,B171,'D.A. D'!$B$19:$B$47,\">0\")+SUMIFS('D.A. D'!$C$19:$C$47,'D.A. D'!$A$19:$A$47,B171,'D.A. D'!$C$19:$C$47,\">0\")","v":0},{"$f":"SUMIFS('D.A. D'!$K$19:$K$47,'D.A. D'!$A$19:$A$47,B171,'D.A. D'!$K$19:$K$47,\">0\")","v":0},{"$f":"IF(OFFSET(INDEX('D.A. D'!$A$19:$A$47,MATCH(B171,'D.A. D'!$A$19:$A$47,0),1),0,12)=0,\"\",IF(LEN(OFFSET(INDEX('D.A. D'!$A$19:$A$47,MATCH(B171,'D.A. D'!$A$19:$A$47,0),1),0,12))>27,LEFT(OFFSET(INDEX('D.A. D'!$A$19:$A$47,MATCH(B171,'D.A. D'!$A$19:$A$47,0),1),0,12),27)&\"…\",OFFSET(INDEX('D.A. D'!$A$19:$A$47,MATCH(B171,'D.A. D'!$A$19:$A$47,0),1),0,12)))","v":""},null,null,null,""]
[null,"Water Quality Swale, Level 2",{"$f":"SUMIFS('D.A. D'!$B$19:$B$47,'D.A. D'!$A$19:$A$47,B172,'D.A. D'!$B$19:$B$47,\">0\")+SUMIFS('D.A. D'!$C$19:$C$47,'D.A. D'!$A$19:$A$47,B172,'D.A. D'!$C$19:$C$47,\">0\")","v":0},{"$f":"SUMIFS('D.A. D'!$K$19:$K$47,'D.A. D'!$A$19:$A$47,B172,'D.A. D'!$K$19:$K$47,\">0\")","v":0},{"$f":"IF(OFFSET(INDEX('D.A. D'!$A$19:$A$47,MATCH(B172,'D.A. D'!$A$19:$A$47,0),1),0,12)=0,\"\",IF(LEN(OFFSET(INDEX('D.A. D'!$A$19:$A$47,MATCH(B172,'D.A. D'!$A$19:$A$47,0),1),0,12))>27,LEFT(OFFSET(INDEX('D.A. D'!$A$19:$A$47,MATCH(B172,'D.A. D'!$A$19:$A$47,0),1),0,12),27)&\"…\",OFFSET(INDEX('D.A. D'!$A$19:$A$47,MATCH(B172,'D.A. D'!$A$19:$A$47,0),1),0,12)))","v":""},null,null,null,""]
[null,"Bioretention, Level 1 or Urban Bioretention (4.2.3.B)",{"$f":"SUMIFS('D.A. D'!$B$19:$B$47,'D.A. D'!$A$19:$A$47,B173,'D.A. D'!$B$19:$B$47,\">0\")+SUMIFS('D.A. D'!$C$19:$C$47,'D.A. D'!$A$19:$A$47,B173,'D.A. D'!$C$19:$C$47,\">0\")","v":0},{"$f":"SUMIFS('D.A. D'!$K$19:$K$47,'D.A. D'!$A$19:$A$47,B173,'D.A. D'!$K$19:$K$47,\">0\")","v":0},{"$f":"IF(OFFSET(INDEX('D.A. D'!$A$19:$A$47,MATCH(B173,'D.A. D'!$A$19:$A$47,0),1),0,12)=0,\"\",IF(LEN(OFFSET(INDEX('D.A. D'!$A$19:$A$47,MATCH(B173,'D.A. D'!$A$19:$A$47,0),1),0,12))>27,LEFT(OFFSET(INDEX('D.A. D'!$A$19:$A$47,MATCH(B173,'D.A. D'!$A$19:$A$47,0),1),0,12),27)&\"…\",OFFSET(INDEX('D.A. D'!$A$19:$A$47,MATCH(B173,'D.A. D'!$A$19:$A$47,0),1),0,12)))","v":""},null,null,null,""]
[null,"Bioretention, Level 2",{"$f":"SUMIFS('D.A. D'!$B$19:$B$47,'D.A. D'!$A$19:$A$47,B174,'D.A. D'!$B$19:$B$47,\">0\")+SUMIFS('D.A. D'!$C$19:$C$47,'D.A. D'!$A$19:$A$47,B174,'D.A. D'!$C$19:$C$47,\">0\")","v":0},{"$f":"SUMIFS('D.A. D'!$K$19:$K$47,'D.A. D'!$A$19:$A$47,B174,'D.A. D'!$K$19:$K$47,\">0\")","v":0},{"$f":"IF(OFFSET(INDEX('D.A. D'!$A$19:$A$47,MATCH(B174,'D.A. D'!$A$19:$A$47,0),1),0,12)=0,\"\",IF(LEN(OFFSET(INDEX('D.A. D'!$A$19:$A$47,MATCH(B174,'D.A. D'!$A$19:$A$47,0),1),0,12))>27,LEFT(OFFSET(INDEX('D.A. D'!$A$19:$A$47,MATCH(B174,'D.A. D'!$A$19:$A$47,0),1),0,12),27)&\"…\",OFFSET(INDEX('D.A. D'!$A$19:$A$47,MATCH(B174,'D.A. D'!$A$19:$A$47,0),1),0,12)))","v":""},null,null,null,""]
[null,"Infiltration",{"$f":"SUMIFS('D.A. D'!$B$19:$B$47,'D.A. D'!$A$19:$A$47,B175,'D.A. D'!$B$19:$B$47,\">0\")+SUMIFS('D.A. D'!$C$19:$C$47,'D.A. D'!$A$19:$A$47,B175,'D.A. D'!$C$19:$C$47,\">0\")","v":0},{"$f":"SUMIFS('D.A. D'!$K$19:$K$47,'D.A. D'!$A$19:$A$47,B175,'D.A. D'!$K$19:$K$47,\">0\")","v":0},{"$f":"IF(OFFSET(INDEX('D.A. D'!$A$19:$A$47,MATCH(B175,'D.A. D'!$A$19:$A$47,0),1),0,12)=0,\"\",IF(LEN(OFFSET(INDEX('D.A. D'!$A$19:$A$47,MATCH(B175,'D.A. D'!$A$19:$A$47,0),1),0,12))>27,LEFT(OFFSET(INDEX('D.A. D'!$A$19:$A$47,MATCH(B175,'D.A. D'!$A$19:$A$47,0),1),0,12),27)&\"…\",OFFSET(INDEX('D.A. D'!$A$19:$A$47,MATCH(B175,'D.A. D'!$A$19:$A$47,0),1),0,12)))","v":""},null,null,null,""]
[null,"*Filtration Practice/Stormwater Wetland do NOT receive runoff reduction values, but do have associated pollutant removal values",{"$f":"SUMIFS('D.A. D'!$B$19:$B$47,'D.A. D'!$A$19:$A$47,B176,'D.A. D'!$B$19:$B$47,\">0\")+SUMIFS('D.A. D'!$C$19:$C$47,'D.A. D'!$A$19:$A$47,B176,'D.A. D'!$C$19:$C$47,\">0\")","v":0},{"$f":"SUMIFS('D.A. D'!$K$19:$K$47,'D.A. D'!$A$19:$A$47,B176,'D.A. D'!$K$19:$K$47,\">0\")","v":0},{"$f":"IF(OFFSET(INDEX('D.A. D'!$A$19:$A$47,MATCH(B176,'D.A. D'!$A$19:$A$47,0),1),0,12)=0,\"\",IF(LEN(OFFSET(INDEX('D.A. D'!$A$19:$A$47,MATCH(B176,'D.A. D'!$A$19:$A$47,0),1),0,12))>27,LEFT(OFFSET(INDEX('D.A. D'!$A$19:$A$47,MATCH(B176,'D.A. D'!$A$19:$A$47,0),1),0,12),27)&\"…\",OFFSET(INDEX('D.A. D'!$A$19:$A$47,MATCH(B176,'D.A. D'!$A$19:$A$47,0),1),0,12)))","v":""},null,null,null,""]
[null,"Sheetflow to Conservation Area with A/B Soils",{"$f":"SUMIFS('D.A. D'!$B$19:$B$47,'D.A. D'!$A$19:$A$47,B177,'D.A. D'!$B$19:$B$47,\">0\")+SUMIFS('D.A. D'!$C$19:$C$47,'D.A. D'!$A$19:$A$47,B177,'D.A. D'!$C$19:$C$47,\">0\")","v":0},{"$f":"SUMIFS('D.A. D'!$K$19:$K$47,'D.A. D'!$A$19:$A$47,B177,'D.A. D'!$K$19:$K$47,\">0\")","v":0},{"$f":"IF(OFFSET(INDEX('D.A. D'!$A$19:$A$47,MATCH(B177,'D.A. D'!$A$19:$A$47,0),1),0,12)=0,\"\",IF(LEN(OFFSET(INDEX('D.A. D'!$A$19:$A$47,MATCH(B177,'D.A. D'!$A$19:$A$47,0),1),0,12))>27,LEFT(OFFSET(INDEX('D.A. D'!$A$19:$A$47,MATCH(B177,'D.A. D'!$A$19:$A$47,0),1),0,12),27)&\"…\",OFFSET(INDEX('D.A. D'!$A$19:$A$47,MATCH(B177,'D.A. D'!$A$19:$A$47,0),1),0,12)))","v":""},null,null,null,""]
[null,"Sheetflow to Conservation Area with C/D Soils",{"$f":"SUMIFS('D.A. D'!$B$19:$B$47,'D.A. D'!$A$19:$A$47,B178,'D.A. D'!$B$19:$B$47,\">0\")+SUMIFS('D.A. D'!$C$19:$C$47,'D.A. D'!$A$19:$A$47,B178,'D.A. D'!$C$19:$C$47,\">0\")","v":0},{"$f":"SUMIFS('D.A. D'!$K$19:$K$47,'D.A. D'!$A$19:$A$47,B178,'D.A. D'!$K$19:$K$47,\">0\")","v":0},{"$f":"IF(OFFSET(INDEX('D.A. D'!$A$19:$A$47,MATCH(B178,'D.A. D'!$A$19:$A$47,0),1),0,12)=0,\"\",IF(LEN(OFFSET(INDEX('D.A. D'!$A$19:$A$47,MATCH(B178,'D.A. D'!$A$19:$A$47,0),1),0,12))>27,LEFT(OFFSET(INDEX('D.A. D'!$A$19:$A$47,MATCH(B178,'D.A. D'!$A$19:$A$47,0),1),0,12),27)&\"…\",OFFSET(INDEX('D.A. D'!$A$19:$A$47,MATCH(B178,'D.A. D'!$A$19:$A$47,0),1),0,12)))","v":""},null,null,null,""]
[null,"Sheetflow to Vegetated Filter Strip in A/B Soils or Compost Amended C/D Soils",{"$f":"SUMIFS('D.A. D'!$B$19:$B$47,'D.A. D'!$A$19:$A$47,B179,'D.A. D'!$B$19:$B$47,\">0\")+SUMIFS('D.A. D'!$C$19:$C$47,'D.A. D'!$A$19:$A$47,B179,'D.A. D'!$C$19:$C$47,\">0\")","v":0},{"$f":"SUMIFS('D.A. D'!$K$19:$K$47,'D.A. D'!$A$19:$A$47,B179,'D.A. D'!$K$19:$K$47,\">0\")","v":0},{"$f":"IF(OFFSET(INDEX('D.A. D'!$A$19:$A$47,MATCH(B179,'D.A. D'!$A$19:$A$47,0),1),0,12)=0,\"\",IF(LEN(OFFSET(INDEX('D.A. D'!$A$19:$A$47,MATCH(B179,'D.A. D'!$A$19:$A$47,0),1),0,12))>27,LEFT(OFFSET(INDEX('D.A. D'!$A$19:$A$47,MATCH(B179,'D.A. D'!$A$19:$A$47,0),1),0,12),27)&\"…\",OFFSET(INDEX('D.A. D'!$A$19:$A$47,MATCH(B179,'D.A. D'!$A$19:$A$47,0),1),0,12)))","v":""},null,null,null,""]
[null,"Sheet flow to Vegetated Filter Strip in C/D Soils",{"$f":"SUMIFS('D.A. D'!$B$19:$B$47,'D.A. D'!$A$19:$A$47,B180,'D.A. D'!$B$19:$B$47,\">0\")+SUMIFS('D.A. D'!$C$19:$C$47,'D.A. D'!$A$19:$A$47,B180,'D.A. D'!$C$19:$C$47,\">0\")","v":0},{"$f":"SUMIFS('D.A. D'!$K$19:$K$47,'D.A. D'!$A$19:$A$47,B180,'D.A. D'!$K$19:$K$47,\">0\")","v":0},{"$f":"IF(OFFSET(INDEX('D.A. D'!$A$19:$A$47,MATCH(B180,'D.A. D'!$A$19:$A$47,0),1),0,12)=0,\"\",IF(LEN(OFFSET(INDEX('D.A. D'!$A$19:$A$47,MATCH(B180,'D.A. D'!$A$19:$A$47,0),1),0,12))>27,LEFT(OFFSET(INDEX('D.A. D'!$A$19:$A$47,MATCH(B180,'D.A. D'!$A$19:$A$47,0),1),0,12),27)&\"…\",OFFSET(INDEX('D.A. D'!$A$19:$A$47,MATCH(B180,'D.A. D'!$A$19:$A$47,0),1),0,12)))","v":""},null,null,null,""]
[null,null,null,null,null,null,null,null,{"$f":"IF(SUM($F$24:$F$26)<>0,1,\"\")","v":""}]
[null,"Total Impervious Cover Treated (acres)",{"$f":"'D.A. D'!B48","v":0},null,null,null,null,null,{"$f":"IF(SUM($F$24:$F$26)<>0,1,\"\")","v":""}]
[null,"Total Turf Area Treated (acres) ",{"$f":"'D.A. D'!C48","v":0},null,null,null,null,null,{"$f":"IF(SUM($F$24:$F$26)<>0,1,\"\")","v":""}]
[]
[]
[null,"Drainage Area E Summary",null,null,null,null,null,null,{"$f":"IF(SUM($G$24:$G$26)<>0,1,\"\")","v":""}]
[null,null,null,null,null,null,null,null,{"$f":"IF(SUM($G$24:$G$26)<>0,1,\"\")","v":""}]
[null,"Land Cover Summary",null,null,null,null,null,null,""]
[null,null,null,null,null,null,null,null,""]
[null,null,"A Soils","B Soils","C Soils","D Soils","Total","% of Total",""]
[null,"Forest (acres)",{"$f":"'Site Data'!B45","v":0},{"$f":"'Site Data'!C45","v":0},{"$f":"'Site Data'!D45","v":0},{"$f":"'Site Data'!E45","v":0},{"$f":"'Site Data'!F45","v":0},{"$f":"IF(G$38>0,G191/G$38*100,0)","v":0},""]
[null,"Turf (acres)",{"$f":"'Site Data'!B46","v":0},{"$f":"'Site Data'!C46","v":0},{"$f":"'Site Data'!D46","v":0},{"$f":"'Site Data'!E46","v":0},{"$f":"'Site Data'!F46","v":0},{"$f":"IF(G$38>0,G192/G$38*100,0)","v":0},""]
[null,"Impervious (acres)",{"$f":"'Site Data'!B47","v":0},{"$f":"'Site Data'!C47","v":0},{"$f":"'Site Data'!D47","v":0},{"$f":"'Site Data'!E47","v":0},{"$f":"'Site Data'!F47","v":0},{"$f":"IF(G$38>0,G193/G$38*100,0)","v":0},""]
[null,null,null,null,null,null,{"$f":"SUM(G191:G193)","v":0},null,""]
[null,null,null,null,null,null,null,null,""]
[null,"BMP Selections",null,null,null,null,null,null,""]
[null,null,null,null,null,null,null,null,""]
[null,{"$f":"IF(SUM(I199:I219)>0,\"Practice\",\"No Practices in this Drainage Area\")","v":"No Practices in this Drainage Area"},"Credit Area (acres)","Runoff Reduction (ft3)","Downstream Practice",null,null,null,""]
[null,"Vegetated Roof",{"$f":"SUMIFS('D.A. E'!$B$19:$B$47,'D.A. E'!$A$19:$A$47,B199,'D.A. E'!$B$19:$B$47,\">0\")+SUMIFS('D.A. E'!$C$19:$C$47,'D.A. E'!$A$19:$A$47,B199,'D.A. E'!$C$19:$C$47,\">0\")","v":0},{"$f":"SUMIFS('D.A. E'!$K$19:$K$47,'D.A. E'!$A$19:$A$47,B199,'D.A. E'!$K$19:$K$47,\">0\")","v":0},{"$f":"IF(OFFSET(INDEX('D.A. E'!$A$19:$A$47,MATCH(B199,'D.A. E'!$A$19:$A$47,0),1),0,12)=0,\"\",IF(LEN(OFFSET(INDEX('D.A. E'!$A$19:$A$47,MATCH(B199,'D.A. E'!$A$19:$A$47,0),1),0,12))>27,LEFT(OFFSET(INDEX('D.A. E'!$A$19:$A$47,MATCH(B199,'D.A. E'!$A$19:$A$47,0),1),0,12),27)&\"…\",OFFSET(INDEX('D.A. E'!$A$19:$A$47,MATCH(B199,'D.A. E'!$A$19:$A$47,0),1),0,12)))","v":""},null,null,null,{"$f":"IF(AND(D199>0,SUM($G$24:$G$26)>0),1,\"\")","v":""}]
[null,"Simple Disconnection to A/B Soils or Soil-Amended Filter Path in C/D Soils (4.2.2, Appendix D)",{"$f":"SUMIFS('D.A. E'!$B$19:$B$47,'D.A. E'!$A$19:$A$47,B200,'D.A. E'!$B$19:$B$47,\">0\")+SUMIFS('D.A. E'!$C$19:$C$47,'D.A. E'!$A$19:$A$47,B200,'D.A. E'!$C$19:$C$47,\">0\")","v":0},{"$f":"SUMIFS('D.A. E'!$K$19:$K$47,'D.A. E'!$A$19:$A$47,B200,'D.A. E'!$K$19:$K$47,\">0\")","v":0},{"$f":"IF(OFFSET(INDEX('D.A. E'!$A$19:$A$47,MATCH(B200,'D.A. E'!$A$19:$A$47,0),1),0,12)=0,\"\",IF(LEN(OFFSET(INDEX('D.A. E'!$A$19:$A$47,MATCH(B200,'D.A. E'!$A$19:$A$47,0),1),0,12))>27,LEFT(OFFSET(INDEX('D.A. E'!$A$19:$A$47,MATCH(B200,'D.A. E'!$A$19:$A$47,0),1),0,12),27)&\"…\",OFFSET(INDEX('D.A. E'!$A$19:$A$47,MATCH(B200,'D.A. E'!$A$19:$A$47,0),1),0,12)))","v":""},null,null,null,{"$f":"IF(AND(D200>0,SUM($G$24:$G$26)>0),1,\"\")","v":""}]
[null,"Simple Disconnection to C/D Soils (4.2.2)",{"$f":"SUMIFS('D.A. E'!$B$19:$B$47,'D.A. E'!$A$19:$A$47,B201,'D.A. E'!$B$19:$B$47,\">0\")+SUMIFS('D.A. E'!$C$19:$C$47,'D.A. E'!$A$19:$A$47,B201,'D.A. E'!$C$19:$C$47,\">0\")","v":0},{"$f":"SUMIFS('D.A. E'!$K$19:$K$47,'D.A. E'!$A$19:$A$47,B201,'D.A. E'!$K$19:$K$47,\">0\")","v":0},{"$f":"IF(OFFSET(INDEX('D.A. E'!$A$19:$A$47,MATCH(B201,'D.A. E'!$A$19:$A$47,0),1),0,12)=0,\"\",IF(LEN(OFFSET(INDEX('D.A. E'!$A$19:$A$47,MATCH(B201,'D.A. E'!$A$19:$A$47,0),1),0,12))>27,LEFT(OFFSET(INDEX('D.A. E'!$A$19:$A$47,MATCH(B201,'D.A. E'!$A$19:$A$47,0),1),0,12),27)&\"…\",OFFSET(INDEX('D.A. E'!$A$19:$A$47,MATCH(B201,'D.A. E'!$A$19:$A$47,0),1),0,12)))","v":""},null,null,null,""]
[null,"To Residential Rain Garden (4.2.3.C)",{"$f":"SUMIFS('D.A. E'!$B$19:$B$47,'D.A. E'!$A$19:$A$47,B202,'D.A. E'!$B$19:$B$47,\">0\")+SUMIFS('D.A. E'!$C$19:$C$47,'D.A. E'!$A$19:$A$47,B202,'D.A. E'!$C$19:$C$47,\">0\")","v":0},{"$f":"SUMIFS('D.A. E'!$K$19:$K$47,'D.A. E'!$A$19:$A$47,B202,'D.A. E'!$K$19:$K$47,\">0\")","v":0},{"$f":"IF(OFFSET(INDEX('D.A. E'!$A$19:$A$47,MATCH(B202,'D.A. E'!$A$19:$A$47,0),1),0,12)=0,\"\",IF(LEN(OFFSET(INDEX('D.A. E'!$A$19:$A$47,MATCH(B202,'D.A. E'!$A$19:$A$47,0),1),0,12))>27,LEFT(OFFSET(INDEX('D.A. E'!$A$19:$A$47,MATCH(B202,'D.A. E'!$A$19:$A$47,0),1),0,12),27)&\"…\",OFFSET(INDEX('D.A. E'!$A$19:$A$47,MATCH(B202,'D.A. E'!$A$19:$A$47,0),1),0,12)))","v":""},null,null,null,""]
[null,"To Rainwater Harvesting (4.2.8)",{"$f":"SUMIFS('D.A. E'!$B$19:$B$47,'D.A. E'!$A$19:$A$47,B203,'D.A. E'!$B$19:$B$47,\">0\")+SUMIFS('D.A. E'!$C$19:$C$47,'D.A. E'!$A$19:$A$47,B203,'D.A. E'!$C$19:$C$47,\">0\")","v":0},{"$f":"SUMIFS('D.A. E'!$K$19:$K$47,'D.A. E'!$A$19:$A$47,B203,'D.A. E'!$K$19:$K$47,\">0\")","v":0},{"$f":"IF(OFFSET(INDEX('D.A. E'!$A$19:$A$47,MATCH(B203,'D.A. E'!$A$19:$A$47,0),1),0,12)=0,\"\",IF(LEN(OFFSET(INDEX('D.A. E'!$A$19:$A$47,MATCH(B203,'D.A. E'!$A$19:$A$47,0),1),0,12))>27,LEFT(OFFSET(INDEX('D.A. E'!$A$19:$A$47,MATCH(B203,'D.A. E'!$A$19:$A$47,0),1),0,12),27)&\"…\",OFFSET(INDEX('D.A. E'!$A$19:$A$47,MATCH(B203,'D.A. E'!$A$19:$A$47,0),1),0,12)))","v":""},null,null,null,""]
[null,"Permeable Pavement, Level 1",{"$f":"SUMIFS('D.A. E'!$B$19:$B$47,'D.A. E'!$A$19:$A$47,B204,'D.A. E'!$B$19:$B$47,\">0\")+SUMIFS('D.A. E'!$C$19:$C$47,'D.A. E'!$A$19:$A$47,B204,'D.A. E'!$C$19:$C$47,\">0\")","v":0},{"$f":"SUMIFS('D.A. E'!$K$19:$K$47,'D.A. E'!$A$19:$A$47,B204,'D.A. E'!$K$19:$K$47,\">0\")","v":0},{"$f":"IF(OFFSET(INDEX('D.A. E'!$A$19:$A$47,MATCH(B204,'D.A. E'!$A$19:$A$47,0),1),0,12)=0,\"\",IF(LEN(OFFSET(INDEX('D.A. E'!$A$19:$A$47,MATCH(B204,'D.A. E'!$A$19:$A$47,0),1),0,12))>27,LEFT(OFFSET(INDEX('D.A. E'!$A$19:$A$47,MATCH(B204,'D.A. E'!$A$19:$A$47,0),1),0,12),27)&\"…\",OFFSET(INDEX('D.A. E'!$A$19:$A$47,MATCH(B204,'D.A. E'!$A$19:$A$47,0),1),0,12)))","v":""},null,null,null,""]
[null,"Permeable Pavement, Level 2 (infiltration)",{"$f":"SUMIFS('D.A. E'!$B$19:$B$47,'D.A. E'!$A$19:$A$47,B205,'D.A. E'!$B$19:$B$47,\">0\")+SUMIFS('D.A. E'!$C$19:$C$47,'D.A. E'!$A$19:$A$47,B205,'D.A. E'!$C$19:$C$47,\">0\")","v":0},{"$f":"SUMIFS('D.A. E'!$K$19:$K$47,'D.A. E'!$A$19:$A$47,B205,'D.A. E'!$K$19:$K$47,\">0\")","v":0},{"$f":"IF(OFFSET(INDEX('D.A. E'!$A$19:$A$47,MATCH(B205,'D.A. E'!$A$19:$A$47,0),1),0,12)=0,\"\",IF(LEN(OFFSET(INDEX('D.A. E'!$A$19:$A$47,MATCH(B205,'D.A. E'!$A$19:$A$47,0),1),0,12))>27,LEFT(OFFSET(INDEX('D.A. E'!$A$19:$A$47,MATCH(B205,'D.A. E'!$A$19:$A$47,0),1),0,12),27)&\"…\",OFFSET(INDEX('D.A. E'!$A$19:$A$47,MATCH(B205,'D.A. E'!$A$19:$A$47,0),1),0,12)))","v":""},null,null,null,""]
[null,"Permeable Pavement, Level 2 (infiltration & underdrain)",{"$f":"SUMIFS('D.A. E'!$B$19:$B$47,'D.A. E'!$A$19:$A$47,B206,'D.A. E'!$B$19:$B$47,\">0\")+SUMIFS('D.A. E'!$C$19:$C$47,'D.A. E'!$A$19:$A$47,B206,'D.A. E'!$C$19:$C$47,\">0\")","v":0},{"$f":"SUMIFS('D.A. E'!$K$19:$K$47,'D.A. E'!$A$19:$A$47,B206,'D.A. E'!$K$19:$K$47,\">0\")","v":0},{"$f":"IF(OFFSET(INDEX('D.A. E'!$A$19:$A$47,MATCH(B206,'D.A. E'!$A$19:$A$47,0),1),0,12)=0,\"\",IF(LEN(OFFSET(INDEX('D.A. E'!$A$19:$A$47,MATCH(B206,'D.A. E'!$A$19:$A$47,0),1),0,12))>27,LEFT(OFFSET(INDEX('D.A. E'!$A$19:$A$47,MATCH(B206,'D.A. E'!$A$19:$A$47,0),1),0,12),27)&\"…\",OFFSET(INDEX('D.A. E'!$A$19:$A$47,MATCH(B206,'D.A. E'!$A$19:$A$47,0),1),0,12)))","v":""},null,null,null,""]
[null,"Grass Swale A/B Soils",{"$f":"SUMIFS('D.A. E'!$B$19:$B$47,'D.A. E'!$A$19:$A$47,B207,'D.A. E'!$B$19:$B$47,\">0\")+SUMIFS('D.A. E'!$C$19:$C$47,'D.A. E'!$A$19:$A$47,B207,'D.A. E'!$C$19:$C$47,\">0\")","v":0},{"$f":"SUMIFS('D.A. E'!$K$19:$K$47,'D.A. E'!$A$19:$A$47,B207,'D.A. E'!$K$19:$K$47,\">0\")","v":0},{"$f":"IF(OFFSET(INDEX('D.A. E'!$A$19:$A$47,MATCH(B207,'D.A. E'!$A$19:$A$47,0),1),0,12)=0,\"\",IF(LEN(OFFSET(INDEX('D.A. E'!$A$19:$A$47,MATCH(B207,'D.A. E'!$A$19:$A$47,0),1),0,12))>27,LEFT(OFFSET(INDEX('D.A. E'!$A$19:$A$47,MATCH(B207,'D.A. E'!$A$19:$A$47,0),1),0,12),27)&\"…\",OFFSET(INDEX('D.A. E'!$A$19:$A$47,MATCH(B207,'D.A. E'!$A$19:$A$47,0),1),0,12)))","v":""},null,null,null,""]
[null,"Grass Swale C/D Soils",{"$f":"SUMIFS('D.A. E'!$B$19:$B$47,'D.A. E'!$A$19:$A$47,B208,'D.A. E'!$B$19:$B$47,\">0\")+SUMIFS('D.A. E'!$C$19:$C$47,'D.A. E'!$A$19:$A$47,B208,'D.A. E'!$C$19:$C$47,\">0\")","v":0},{"$f":"SUMIFS('D.A. E'!$K$19:$K$47,'D.A. E'!$A$19:$A$47,B208,'D.A. E'!$K$19:$K$47,\">0\")","v":0},{"$f":"IF(OFFSET(INDEX('D.A. E'!$A$19:$A$47,MATCH(B208,'D.A. E'!$A$19:$A$47,0),1),0,12)=0,\"\",IF(LEN(OFFSET(INDEX('D.A. E'!$A$19:$A$47,MATCH(B208,'D.A. E'!$A$19:$A$47,0),1),0,12))>27,LEFT(OFFSET(INDEX('D.A. E'!$A$19:$A$47,MATCH(B208,'D.A. E'!$A$19:$A$47,0),1),0,12),27)&\"…\",OFFSET(INDEX('D.A. E'!$A$19:$A$47,MATCH(B208,'D.A. E'!$A$19:$A$47,0),1),0,12)))","v":""},null,null,null,""]
[null,"Grass Swale in C/D Soil with Soil Amendments",{"$f":"SUMIFS('D.A. E'!$B$19:$B$47,'D.A. E'!$A$19:$A$47,B209,'D.A. E'!$B$19:$B$47,\">0\")+SUMIFS('D.A. E'!$C$19:$C$47,'D.A. E'!$A$19:$A$47,B209,'D.A. E'!$C$19:$C$47,\">0\")","v":0},{"$f":"SUMIFS('D.A. E'!$K$19:$K$47,'D.A. E'!$A$19:$A$47,B209,'D.A. E'!$K$19:$K$47,\">0\")","v":0},{"$f":"IF(OFFSET(INDEX('D.A. E'!$A$19:$A$47,MATCH(B209,'D.A. E'!$A$19:$A$47,0),1),0,12)=0,\"\",IF(LEN(OFFSET(INDEX('D.A. E'!$A$19:$A$47,MATCH(B209,'D.A. E'!$A$19:$A$47,0),1),0,12))>27,LEFT(OFFSET(INDEX('D.A. E'!$A$19:$A$47,MATCH(B209,'D.A. E'!$A$19:$A$47,0),1),0,12),27)&\"…\",OFFSET(INDEX('D.A. E'!$A$19:$A$47,MATCH(B209,'D.A. E'!$A$19:$A$47,0),1),0,12)))","v":""},null,null,null,""]
[null,"Water Quality Swale, Level 1",{"$f":"SUMIFS('D.A. E'!$B$19:$B$47,'D.A. E'!$A$19:$A$47,B210,'D.A. E'!$B$19:$B$47,\">0\")+SUMIFS('D.A. E'!$C$19:$C$47,'D.A. E'!$A$19:$A$47,B210,'D.A. E'!$C$19:$C$47,\">0\")","v":0},{"$f":"SUMIFS('D.A. E'!$K$19:$K$47,'D.A. E'!$A$19:$A$47,B210,'D.A. E'!$K$19:$K$47,\">0\")","v":0},{"$f":"IF(OFFSET(INDEX('D.A. E'!$A$19:$A$47,MATCH(B210,'D.A. E'!$A$19:$A$47,0),1),0,12)=0,\"\",IF(LEN(OFFSET(INDEX('D.A. E'!$A$19:$A$47,MATCH(B210,'D.A. E'!$A$19:$A$47,0),1),0,12))>27,LEFT(OFFSET(INDEX('D.A. E'!$A$19:$A$47,MATCH(B210,'D.A. E'!$A$19:$A$47,0),1),0,12),27)&\"…\",OFFSET(INDEX('D.A. E'!$A$19:$A$47,MATCH(B210,'D.A. E'!$A$19:$A$47,0),1),0,12)))","v":""},null,null,null,""]
[null,"Water Quality Swale, Level 2",{"$f":"SUMIFS('D.A. E'!$B$19:$B$47,'D.A. E'!$A$19:$A$47,B211,'D.A. E'!$B$19:$B$47,\">0\")+SUMIFS('D.A. E'!$C$19:$C$47,'D.A. E'!$A$19:$A$47,B211,'D.A. E'!$C$19:$C$47,\">0\")","v":0},{"$f":"SUMIFS('D.A. E'!$K$19:$K$47,'D.A. E'!$A$19:$A$47,B211,'D.A. E'!$K$19:$K$47,\">0\")","v":0},{"$f":"IF(OFFSET(INDEX('D.A. E'!$A$19:$A$47,MATCH(B211,'D.A. E'!$A$19:$A$47,0),1),0,12)=0,\"\",IF(LEN(OFFSET(INDEX('D.A. E'!$A$19:$A$47,MATCH(B211,'D.A. E'!$A$19:$A$47,0),1),0,12))>27,LEFT(OFFSET(INDEX('D.A. E'!$A$19:$A$47,MATCH(B211,'D.A. E'!$A$19:$A$47,0),1),0,12),27)&\"…\",OFFSET(INDEX('D.A. E'!$A$19:$A$47,MATCH(B211,'D.A. E'!$A$19:$A$47,0),1),0,12)))","v":""},null,null,null,""]
[null,"Bioretention, Level 1 or Urban Bioretention (4.2.3.B)",{"$f":"SUMIFS('D.A. E'!$B$19:$B$47,'D.A. E'!$A$19:$A$47,B212,'D.A. E'!$B$19:$B$47,\">0\")+SUMIFS('D.A. E'!$C$19:$C$47,'D.A. E'!$A$19:$A$47,B212,'D.A. E'!$C$19:$C$47,\">0\")","v":0},{"$f":"SUMIFS('D.A. E'!$K$19:$K$47,'D.A. E'!$A$19:$A$47,B212,'D.A. E'!$K$19:$K$47,\">0\")","v":0},{"$f":"IF(OFFSET(INDEX('D.A. E'!$A$19:$A$47,MATCH(B212,'D.A. E'!$A$19:$A$47,0),1),0,12)=0,\"\",IF(LEN(OFFSET(INDEX('D.A. E'!$A$19:$A$47,MATCH(B212,'D.A. E'!$A$19:$A$47,0),1),0,12))>27,LEFT(OFFSET(INDEX('D.A. E'!$A$19:$A$47,MATCH(B212,'D.A. E'!$A$19:$A$47,0),1),0,12),27)&\"…\",OFFSET(INDEX('D.A. E'!$A$19:$A$47,MATCH(B212,'D.A. E'!$A$19:$A$47,0),1),0,12)))","v":""},null,null,null,""]
[null,"Bioretention, Level 2",{"$f":"SUMIFS('D.A. E'!$B$19:$B$47,'D.A. E'!$A$19:$A$47,B213,'D.A. E'!$B$19:$B$47,\">0\")+SUMIFS('D.A. E'!$C$19:$C$47,'D.A. E'!$A$19:$A$47,B213,'D.A. E'!$C$19:$C$47,\">0\")","v":0},{"$f":"SUMIFS('D.A. E'!$K$19:$K$47,'D.A. E'!$A$19:$A$47,B213,'D.A. E'!$K$19:$K$47,\">0\")","v":0},{"$f":"IF(OFFSET(INDEX('D.A. E'!$A$19:$A$47,MATCH(B213,'D.A. E'!$A$19:$A$47,0),1),0,12)=0,\"\",IF(LEN(OFFSET(INDEX('D.A. E'!$A$19:$A$47,MATCH(B213,'D.A. E'!$A$19:$A$47,0),1),0,12))>27,LEFT(OFFSET(INDEX('D.A. E'!$A$19:$A$47,MATCH(B213,'D.A. E'!$A$19:$A$47,0),1),0,12),27)&\"…\",OFFSET(INDEX('D.A. E'!$A$19:$A$47,MATCH(B213,'D.A. E'!$A$19:$A$47,0),1),0,12)))","v":""},null,null,null,""]
[null,"Infiltration",{"$f":"SUMIFS('D.A. E'!$B$19:$B$47,'D.A. E'!$A$19:$A$47,B214,'D.A. E'!$B$19:$B$47,\">0\")+SUMIFS('D.A. E'!$C$19:$C$47,'D.A. E'!$A$19:$A$47,B214,'D.A. E'!$C$19:$C$47,\">0\")","v":0},{"$f":"SUMIFS('D.A. E'!$K$19:$K$47,'D.A. E'!$A$19:$A$47,B214,'D.A. E'!$K$19:$K$47,\">0\")","v":0},{"$f":"IF(OFFSET(INDEX('D.A. E'!$A$19:$A$47,MATCH(B214,'D.A. E'!$A$19:$A$47,0),1),0,12)=0,\"\",IF(LEN(OFFSET(INDEX('D.A. E'!$A$19:$A$47,MATCH(B214,'D.A. E'!$A$19:$A$47,0),1),0,12))>27,LEFT(OFFSET(INDEX('D.A. E'!$A$19:$A$47,MATCH(B214,'D.A. E'!$A$19:$A$47,0),1),0,12),27)&\"…\",OFFSET(INDEX('D.A. E'!$A$19:$A$47,MATCH(B214,'D.A. E'!$A$19:$A$47,0),1),0,12)))","v":""},null,null,null,""]
[null,"*Filtration Practice/Stormwater Wetland do NOT receive runoff reduction values, but do have associated pollutant removal values",{"$f":"SUMIFS('D.A. E'!$B$19:$B$47,'D.A. E'!$A$19:$A$47,B215,'D.A. E'!$B$19:$B$47,\">0\")+SUMIFS('D.A. E'!$C$19:$C$47,'D.A. E'!$A$19:$A$47,B215,'D.A. E'!$C$19:$C$47,\">0\")","v":0},{"$f":"SUMIFS('D.A. E'!$K$19:$K$47,'D.A. E'!$A$19:$A$47,B215,'D.A. E'!$K$19:$K$47,\">0\")","v":0},{"$f":"IF(OFFSET(INDEX('D.A. E'!$A$19:$A$47,MATCH(B215,'D.A. E'!$A$19:$A$47,0),1),0,12)=0,\"\",IF(LEN(OFFSET(INDEX('D.A. E'!$A$19:$A$47,MATCH(B215,'D.A. E'!$A$19:$A$47,0),1),0,12))>27,LEFT(OFFSET(INDEX('D.A. E'!$A$19:$A$47,MATCH(B215,'D.A. E'!$A$19:$A$47,0),1),0,12),27)&\"…\",OFFSET(INDEX('D.A. E'!$A$19:$A$47,MATCH(B215,'D.A. E'!$A$19:$A$47,0),1),0,12)))","v":""},null,null,null,""]
[null,"Sheetflow to Conservation Area with A/B Soils",{"$f":"SUMIFS('D.A. E'!$B$19:$B$47,'D.A. E'!$A$19:$A$47,B216,'D.A. E'!$B$19:$B$47,\">0\")+SUMIFS('D.A. E'!$C$19:$C$47,'D.A. E'!$A$19:$A$47,B216,'D.A. E'!$C$19:$C$47,\">0\")","v":0},{"$f":"SUMIFS('D.A. E'!$K$19:$K$47,'D.A. E'!$A$19:$A$47,B216,'D.A. E'!$K$19:$K$47,\">0\")","v":0},{"$f":"IF(OFFSET(INDEX('D.A. E'!$A$19:$A$47,MATCH(B216,'D.A. E'!$A$19:$A$47,0),1),0,12)=0,\"\",IF(LEN(OFFSET(INDEX('D.A. E'!$A$19:$A$47,MATCH(B216,'D.A. E'!$A$19:$A$47,0),1),0,12))>27,LEFT(OFFSET(INDEX('D.A. E'!$A$19:$A$47,MATCH(B216,'D.A. E'!$A$19:$A$47,0),1),0,12),27)&\"…\",OFFSET(INDEX('D.A. E'!$A$19:$A$47,MATCH(B216,'D.A. E'!$A$19:$A$47,0),1),0,12)))","v":""},null,null,null,""]
[null,"Sheetflow to Conservation Area with C/D Soils",{"$f":"SUMIFS('D.A. E'!$B$19:$B$47,'D.A. E'!$A$19:$A$47,B217,'D.A. E'!$B$19:$B$47,\">0\")+SUMIFS('D.A. E'!$C$19:$C$47,'D.A. E'!$A$19:$A$47,B217,'D.A. E'!$C$19:$C$47,\">0\")","v":0},{"$f":"SUMIFS('D.A. E'!$K$19:$K$47,'D.A. E'!$A$19:$A$47,B217,'D.A. E'!$K$19:$K$47,\">0\")","v":0},{"$f":"IF(OFFSET(INDEX('D.A. E'!$A$19:$A$47,MATCH(B217,'D.A. E'!$A$19:$A$47,0),1),0,12)=0,\"\",IF(LEN(OFFSET(INDEX('D.A. E'!$A$19:$A$47,MATCH(B217,'D.A. E'!$A$19:$A$47,0),1),0,12))>27,LEFT(OFFSET(INDEX('D.A. E'!$A$19:$A$47,MATCH(B217,'D.A. E'!$A$19:$A$47,0),1),0,12),27)&\"…\",OFFSET(INDEX('D.A. E'!$A$19:$A$47,MATCH(B217,'D.A. E'!$A$19:$A$47,0),1),0,12)))","v":""},null,null,null,""]
[null,"Sheetflow to Vegetated Filter Strip in A/B Soils or Compost Amended C/D Soils",{"$f":"SUMIFS('D.A. E'!$B$19:$B$47,'D.A. E'!$A$19:$A$47,B218,'D.A. E'!$B$19:$B$47,\">0\")+SUMIFS('D.A. E'!$C$19:$C$47,'D.A. E'!$A$19:$A$47,B218,'D.A. E'!$C$19:$C$47,\">0\")","v":0},{"$f":"SUMIFS('D.A. E'!$K$19:$K$47,'D.A. E'!$A$19:$A$47,B218,'D.A. E'!$K$19:$K$47,\">0\")","v":0},{"$f":"IF(OFFSET(INDEX('D.A. E'!$A$19:$A$47,MATCH(B218,'D.A. E'!$A$19:$A$47,0),1),0,12)=0,\"\",IF(LEN(OFFSET(INDEX('D.A. E'!$A$19:$A$47,MATCH(B218,'D.A. E'!$A$19:$A$47,0),1),0,12))>27,LEFT(OFFSET(INDEX('D.A. E'!$A$19:$A$47,MATCH(B218,'D.A. E'!$A$19:$A$47,0),1),0,12),27)&\"…\",OFFSET(INDEX('D.A. E'!$A$19:$A$47,MATCH(B218,'D.A. E'!$A$19:$A$47,0),1),0,12)))","v":""},null,null,null,""]
[null,"Sheet flow to Vegetated Filter Strip in C/D Soils",{"$f":"SUMIFS('D.A. E'!$B$19:$B$47,'D.A. E'!$A$19:$A$47,B219,'D.A. E'!$B$19:$B$47,\">0\")+SUMIFS('D.A. E'!$C$19:$C$47,'D.A. E'!$A$19:$A$47,B219,'D.A. E'!$C$19:$C$47,\">0\")","v":0},{"$f":"SUMIFS('D.A. E'!$K$19:$K$47,'D.A. E'!$A$19:$A$47,B219,'D.A. E'!$K$19:$K$47,\">0\")","v":0},{"$f":"IF(OFFSET(INDEX('D.A. E'!$A$19:$A$47,MATCH(B219,'D.A. E'!$A$19:$A$47,0),1),0,12)=0,\"\",IF(LEN(OFFSET(INDEX('D.A. E'!$A$19:$A$47,MATCH(B219,'D.A. E'!$A$19:$A$47,0),1),0,12))>27,LEFT(OFFSET(INDEX('D.A. E'!$A$19:$A$47,MATCH(B219,'D.A. E'!$A$19:$A$47,0),1),0,12),27)&\"…\",OFFSET(INDEX('D.A. E'!$A$19:$A$47,MATCH(B219,'D.A. E'!$A$19:$A$47,0),1),0,12)))","v":""},null,null,null,""]
[null,null,null,null,null,null,null,null,{"$f":"IF(SUM($G$24:$G$26)<>0,1,\"\")","v":""}]
[null,"Total Impervious Cover Treated (acres)",{"$f":"'D.A. E'!B48","v":0},null,null,null,null,null,{"$f":"IF(SUM($G$24:$G$26)<>0,1,\"\")","v":""}]
[null,"Total Turf Area Treated (acres) ",{"$f":"'D.A. E'!C48","v":0},null,null,null,null,null,{"$f":"IF(SUM($G$24:$G$26)<>0,1,\"\")","v":""}]
[]
[]
[null,"Channel and Flood Protection"]
[]
[null,null,"Weighted CN","1-year storm Adjusted CN","2-year storm Adjusted CN","10-year storm Adjusted CN"]
[null,"Target Rainfall Event (in)",null,{"$f":"'Channel and Flood Protection'!D2","v":2.7},{"$f":"'Channel and Flood Protection'!E2","v":3.35},{"$f":"'Channel and Flood Protection'!F2","v":5.15}]
[null,"D.A. A CN",{"$f":"'Channel and Flood Protection'!G34","v":0},{"$f":"'Channel and Flood Protection'!D38","v":0},{"$f":"'Channel and Flood Protection'!E38","v":0},{"$f":"'Channel and Flood Protection'!F38","v":0}]
[null,"D.A. B CN",{"$f":"'Channel and Flood Protection'!G49","v":0},{"$f":"'Channel and Flood Protection'!D53","v":0},{"$f":"'Channel and Flood Protection'!E53","v":0},{"$f":"'Channel and Flood Protection'!F53","v":0}]
[null,"D.A. C CN",{"$f":"'Channel and Flood Protection'!G64","v":0},{"$f":"'Channel and Flood Protection'!D68","v":0},{"$f":"'Channel and Flood Protection'!E68","v":0},{"$f":"'Channel and Flood Protection'!F68","v":0}]
[null,"D.A. D CN",{"$f":"'Channel and Flood Protection'!G79","v":0},{"$f":"'Channel and Flood Protection'!D83","v":0},{"$f":"'Channel and Flood Protection'!E83","v":0},{"$f":"'Channel and Flood Protection'!F83","v":0}]
[null,"D.A. E CN",{"$f":"'Channel and Flood Protection'!G94","v":0},{"$f":"'Channel and Flood Protection'!D98","v":0},{"$f":"'Channel and Flood Protection'!E98","v":0},{"$f":"'Channel and Flood Protection'!F98","v":0}]